Homoveratric acid, TMS derivative

Van Den Dool and Kratz RI, non-polar column, temperature ramp

View large format table.

Column type Active phase I Reference Comment
CapillaryDB-51725.Jaroszynska and Ligor, 200530. m/0.25 mm/0.25 μm, He, 3. K/min; Tstart: 50. C; Tend: 320. C
CapillaryDB-51729.Jaroszynska and Ligor, 200530. m/0.25 mm/0.25 μm, He, 3. K/min; Tstart: 50. C; Tend: 320. C
CapillaryDB-51729.Jaroszynska and Ligor, 200530. m/0.25 mm/0.25 μm, He, 3. K/min; Tstart: 50. C; Tend: 320. C
CapillaryDB-51729.Jaroszynska and Ligor, 200530. m/0.25 mm/0.25 μm, He, 3. K/min; Tstart: 50. C; Tend: 320. C
CapillaryPE-5ht1725.Jaroszynska and Ligor, 200530. m/0.25 mm/0.1 μm, He, 3. K/min; Tstart: 50. C; Tend: 320. C
CapillaryPE-5ht1725.Jaroszynska and Ligor, 200530. m/0.25 mm/0.1 μm, He, 3. K/min; Tstart: 50. C; Tend: 320. C
CapillaryPE-5ht1726.Jaroszynska and Ligor, 200530. m/0.25 mm/0.1 μm, He, 3. K/min; Tstart: 50. C; Tend: 320. C
CapillaryPE-5ht1727.Jaroszynska and Ligor, 200530. m/0.25 mm/0.1 μm, He, 3. K/min; Tstart: 50. C; Tend: 320. C
CapillaryPE-5ms1712.Jaroszynska and Ligor, 200530. m/0.25 mm/0.25 μm, He, 3. K/min; Tstart: 50. C; Tend: 320. C
CapillaryPE-5ms1712.Jaroszynska and Ligor, 200530. m/0.25 mm/0.25 μm, He, 3. K/min; Tstart: 50. C; Tend: 320. C
CapillaryDB-51727.Jaroszynska, 200330. m/0.25 mm/0.25 μm, He, 3. K/min; Tstart: 50. C; Tend: 240. C
CapillaryDB-51729.Jaroszynska, 200330. m/0.25 mm/0.25 μm, He, 3. K/min; Tstart: 50. C; Tend: 240. C
CapillaryDB-51727.Jaroszynska, 200330. m/0.25 mm/0.25 μm, He, 7. K/min; Tstart: 50. C; Tend: 240. C
CapillaryDB-51729.Jaroszynska, 200330. m/0.25 mm/0.25 μm, He, 7. K/min; Tstart: 50. C; Tend: 240. C
PackedOV-11682.Butts, 1972He, Chromosorb W HP (80-100 mesh), 10. K/min; Column length: 2. m; Tstart: 100. C; Tend: 325. C

References

Jaroszynska and Ligor, 2005
Jaroszynska, J.; Ligor, T., The identification of phenolic compounds by a gas chromatographic method on three capillary columns with the same non-polar stationary phase, Anal. Chim. Acta., 2005, 539, 1-2, 11-15, https://doi.org/10.1016/j.aca.2005.03.024 . [all data]

Jaroszynska, 2003
Jaroszynska, J., Isolation of free phenolic compounds from arboreal leaves by use of the Florisil/C18 system, Anal. Bioanal. Chem., 2003, 377, 4, 702-708, https://doi.org/10.1007/s00216-003-2155-z . [all data]

Butts, 1972
Butts, W.C., Two-Column Gas Chromatography of Trimethylsilyl Derivatives of Biochemically Significant Compounds, Anal. Biochemistry, 1972, 46, 1, 187-199, https://doi.org/10.1016/0003-2697(72)90411-3 . [all data]