3-Hydroxyphenylacetic acid, 2TMS derivative

Van Den Dool and Kratz RI, non-polar column, temperature ramp

Data compiled by: NIST Mass Spectrometry Data Center, William E. Wallace, director

Column type CapillaryCapillaryCapillaryCapillaryCapillary
Active phase CP Sil 5 CBDB-5OV-1SE-52CP Sil 5 CB
Column length (m) 25.30.10.25.
Carrier gas  HeHeHeN2
Substrate
Column diameter (mm) 0.150.250.220.32
Phase thickness (μm) 0.121.0.170.52
Tstart (C) 90.100.70.70.60.
Tend (C) 270.290.270.270.280.
Heat rate (K/min) 10.4.5.5.6.
Initial hold (min) 1.4.  0.5
Final hold (min) 7.10.  5.
I 1600.1616.1597.1619.1597.
ReferenceHalket, Przyborowska, et al., 1999Kimura, Yamamoto, et al., 1999Lefevere, Verhaeghe, et al., 1989Lefevere, Verhaeghe, et al., 1989Wurth, Kumps, et al., 1989
Comment MSDC-RI MSDC-RI MSDC-RI MSDC-RI MSDC-RI
Column type CapillaryPackedPacked
Active phase Ultra-2OV-1OV-1
Column length (m) 25.1.82.
Carrier gas HeN2He
Substrate  100-120 meshChromosorb W HP (80-100 mesh)
Column diameter (mm) 0.31
Phase thickness (μm) 0.52
Tstart (C) 50.70.100.
Tend (C) 300.290.325.
Heat rate (K/min) 5.28.10.
Initial hold (min)  0.5
Final hold (min)
I 1619.1598.1600.
ReferenceTuchman, Bowers, et al., 1984Tanaka, Hine, et al., 1980Butts, 1972
Comment MSDC-RI MSDC-RI MSDC-RI

Van Den Dool and Kratz RI, non-polar column, custom temperature program

Data compiled by: NIST Mass Spectrometry Data Center, William E. Wallace, director

Column type CapillaryCapillaryPacked
Active phase VF-5MSDB-1OV-101
Column length (m) 30.
Carrier gas HeHe
Substrate
Column diameter (mm) 0.25
Phase thickness (μm) 0.25
Program Multi-step temperature program; T(initial)=60C; T(final)=270Cnot specifiednot specified
I 1603.1596.1598.
ReferenceTret'yakov, 2007Tsai, Oliphant, et al., 1985Tanaka and Hine, 1982
Comment MSDC-RI MSDC-RI MSDC-RI

References

Halket, Przyborowska, et al., 1999
Halket, J.N.; Przyborowska, A.; Stein, S.E.; Mallard, W.G.; Down, S.; Chalmers, R., Deconvolution gas chromatography / mass spectrometry of urinary organic acids - potential for pattern recognition and automated identification of metabolic disorders, Rapid Commun. Mass spectrom., 1999, 13, 4, 279-284, https://doi.org/10.1002/(SICI)1097-0231(19990228)13:4<279::AID-RCM478>3.0.CO;2-I . [all data]

Kimura, Yamamoto, et al., 1999
Kimura, M.; Yamamoto, T.; Yamaguchi, S., Automated metabolic profiling and interpretation of GC/MS data for organic acidemia screening: a personal computer-based system, Tohoku J. Exp. Med., 1999, 188, 4, 317-334, https://doi.org/10.1620/tjem.188.317 . [all data]

Lefevere, Verhaeghe, et al., 1989
Lefevere, M.F.; Verhaeghe, B.J.; Declerck, D.H.; Van Bocxlaer, J.F.; De Leenheer, A.P.; De Sagher, R.M., Metabolic Profiling of Urinary Organic Acids by Single and Multicolumn Capillary Gas Chromatography, J. Chromatogr. Sci., 1989, 27, 1, 23-29, https://doi.org/10.1093/chromsci/27.1.23 . [all data]

Wurth, Kumps, et al., 1989
Wurth, C.; Kumps, A.; Mardens, Y., Urinary organic acids: Retention indices on two capillary gas chromatography columns, J. Chromatogr., 1989, 491, 186-192, https://doi.org/10.1016/S0378-4347(00)82831-5 . [all data]

Tuchman, Bowers, et al., 1984
Tuchman, M.; Bowers, L.D.; Fregien, K.D.; Crippin, P.J.; Krivit, W., Capillary Gas Chromatographic Separation of Urinary Organic Acids. Retention Indices of 101 Urinary Acids on a 5% Phenylmethyl Silicone Capillary Column, J. Chromatogr. Sci., 1984, 22, 5, 198-202, https://doi.org/10.1093/chromsci/22.5.198 . [all data]

Tanaka, Hine, et al., 1980
Tanaka, K.; Hine, D.G.; West-Dull, A.; Lynn, T.B., Gas-chromatographic method of analysis for urinary organic acids. I. Retention indices of 155 metabolically important compounds, Clin. Chem., 1980, 26, 13, 1839-1846. [all data]

Butts, 1972
Butts, W.C., Two-Column Gas Chromatography of Trimethylsilyl Derivatives of Biochemically Significant Compounds, Anal. Biochemistry, 1972, 46, 1, 187-199, https://doi.org/10.1016/0003-2697(72)90411-3 . [all data]