Benzene, 1,2-dichloro-4,5-dimethoxy-,

Kovats' RI, non-polar column, isothermal

View large format table.

Column type Active phase Temperature (C) I Reference Comment
CapillarySE-30140.1484.Korhonen, Knuutinen, et al., 1984Column length: 25. m; Column diameter: 0.30 mm
CapillarySE-30160.1483.Korhonen, Knuutinen, et al., 1984Column length: 25. m; Column diameter: 0.30 mm
CapillarySE-30180.1484.Korhonen, Knuutinen, et al., 1984Column length: 25. m; Column diameter: 0.30 mm
CapillarySE-30200.1503.Korhonen, Knuutinen, et al., 1984Column length: 25. m; Column diameter: 0.30 mm

Kovats' RI, polar column, isothermal

View large format table.

Column type Active phase Temperature (C) I Reference Comment
CapillaryOV-351140.2188.Korhonen, Knuutinen, et al., 1984Column length: 25. m; Column diameter: 0.32 mm
CapillaryOV-351160.2203.Korhonen, Knuutinen, et al., 1984Column length: 25. m; Column diameter: 0.32 mm
CapillaryOV-351180.2216.Korhonen, Knuutinen, et al., 1984Column length: 25. m; Column diameter: 0.32 mm
CapillaryOV-351200.2228.Korhonen, Knuutinen, et al., 1984Column length: 25. m; Column diameter: 0.32 mm

Van Den Dool and Kratz RI, non-polar column, temperature ramp

View large format table.

Column type Active phase I Reference Comment
CapillarySE-301497.Korhonen, Knuutinen, et al., 19846. K/min; Column length: 25. m; Column diameter: 0.30 mm; Tstart: 100. C

Van Den Dool and Kratz RI, polar column, temperature ramp

View large format table.

Column type Active phase I Reference Comment
CapillaryOV-3512213.Korhonen, Knuutinen, et al., 19846. K/min; Column length: 25. m; Column diameter: 0.32 mm; Tstart: 100. C

References

Korhonen, Knuutinen, et al., 1984
Korhonen, I.O.O.; Knuutinen, J.; Jaaskelainen, R., Gas-Liquid Chromatographic Analyses. XXIV. Capillary Column Studies of the Chlorinated Veratroles (1,2-Dimethoxybenzenes), J. Chromatogr., 1984, 287, 293-303, https://doi.org/10.1016/S0021-9673(01)87704-9 . [all data]