(E)-N-Isopropylacetaldimine

Reaction thermochemistry data

Data compiled by: Hussein Y. Afeefy, Joel F. Liebman, and Stephen E. Stein

Individual Reactions

Hydrogen + (E)-N-Isopropylacetaldimine = 2-Propanamine, N-ethyl-

By formula: H2 + C5H11N = C5H13N

Quantity Value Units Method Reference Comment
Δr21.9 ± 0.98kcal/molChydHafelinger and Steinmann, 1977liquid phase; solvent: Acetic acid

References

Hafelinger and Steinmann, 1977
Hafelinger, G.; Steinmann, L., Heat of hydrogenation of compounds containing isolated and conjugted C=N bouble bonds, Angew. Chem. Int. Ed. Engl., 1977, 16, 47-48. [all data]