1-Azabicyclo[2.2.2]octane,4-iodo-

Gas phase ion energetics data

Data compiled by: Sharon G. Lias, Rhoda D. Levin, and Sherif A. Kafafi

Ionization energy determinations

IE (eV) Method Reference Comment
8.35 ± 0.015PEBieri and Heilbronner, 1974Vertical value

References

Bieri and Heilbronner, 1974
Bieri, G.; Heilbronner, E., Der einfluss von substituenten in stellung 4 auf das n-ionisations- zpotenial des chinuclidins, Helv. Chim. Acta, 1974, 57, 546. [all data]