3-Methyl-2,8,9-trioxa-5-azonia-1-boratatricyclo[3.3.3.0(1,5)]undecane

Gas phase ion energetics data

Data compiled by: Sharon G. Lias, John E. Bartmess, Joel F. Liebman, John L. Holmes, Rhoda D. Levin, and W. Gary Mallard

Ionization energy determinations

IE (eV) Method Reference Comment
8.9PEPeel, Rothwell, et al., 1987
9.7PEPeel, Rothwell, et al., 1987Vertical value

References

Peel, Rothwell, et al., 1987
Peel, J.B.; Rothwell, R.G.; Dianxum, W., Photoelectron spectroscopic studies of some substituted borotrans, Aust. J. Chem., 1987, 40, 803. [all data]