Pentadecanal-

Normal alkane RI, polar column, custom temperature program

Data compiled by: NIST Mass Spectrometry Data Center, William E. Wallace, director

Column type CapillaryCapillaryCapillaryCapillaryCapillary
Active phase Innowax FSCDB-WaxHP Innowax FSPHP-Innowax FSCHP-Innowax
Column length (m) 60.30.60.60.60.
Carrier gas HeliumHeliumHeliumN2N2
Substrate
Column diameter (mm) 0.250.250.250.250.25
Phase thickness (μm) 0.250.250.250.250.25
Program 60 0C (10 min) 4 0C/min -> 220 0C 1 0C/min -> 240 0Cnot specified60 0C (10 min) 4 0C/min -> 220 0C (10 min) 1 0C/min -> 240 0C (20 min)60C(10min) => 4C/min => 220C(10min) => 1C/min => 240C60C(10min) => 4C/min => 220C(10min) => 1C/min => 240C
I 2041.2054.2041.2041.2041.
ReferenceBardakci, Demirci, et al., 2012Welke, Manfroi, et al., 2012Wedge, Klun, et al., 2009Baser K.H.C. and Demirci B., 2007Duman, Kartal, et al., 2005
Comment MSDC-RI MSDC-RI MSDC-RI MSDC-RI MSDC-RI
Column type CapillaryCapillaryCapillaryCapillaryCapillary
Active phase HP Innowax FSPInnowax FSCHP-Innowax FSCHP-Innowax FSCInnowax FSC
Column length (m) 60.60.60.60.60.
Carrier gas N2HeHeHe
Substrate
Column diameter (mm) 0.250.250.250.250.25
Phase thickness (μm) 0.250.250.250.250.25
Program 60C(10min) => 4C/min => 220C(10min) => 1C/min => 240C60C (10min) => 4C/min => 220C (10min) => 1C/min => 240C60C(10min) => 4C/min => 220C(10min) => 1C/min => 240C60C(10min) => 4C/min => 220C(10min) => 1C/min => 240C(40min)60C(10min) => 4C/min => 220C(10min) => 1C/min => 240C
I 2041.2041.2041.2041.2041.
ReferenceAltintas, Kose, et al., 2004Demirci and Baser, 2003Erdemoglu, Sener, et al., 2003Kürkcüoglu, Demirci, et al., 2003Tunalier, Kirimer, et al., 2002
Comment MSDC-RI MSDC-RI MSDC-RI MSDC-RI MSDC-RI
Column type CapillaryCapillaryCapillaryCapillaryCapillary
Active phase HP-InnowaxHP-Innowax FSCInnowax FSCDB-WaxNB-351
Column length (m) 60.60.60.60.25.
Carrier gas He HeN2He
Substrate
Column diameter (mm) 0.250.250.25 0.32
Phase thickness (μm) 0.250.250.250.250.2
Program 60 0C (10 min) 4 K/min -> 220 0C (10 min) 1 K/min -> 240 0C60C(10min) => 4C/min => 220C(10min) => 1C/min => 240C60C(10 min) => 4C/min => 220C(10min) => 1C/min => 240Cnot specified35C(5min) => 2.5C/min => 150C => 5C/min => 240C (20min)
I 2041.2041.2041.1999.2044.
ReferenceGören, Demirci, et al., 2001Tabanca, Kirimer, et al., 2001Kirimer, Tabanca, et al., 2000Weyerstahl, Marschall, et al., 1998Kerrola and Kallio, 1994
Comment MSDC-RI MSDC-RI MSDC-RI MSDC-RI MSDC-RI

Van Den Dool and Kratz RI, non-polar column, custom temperature program

Data compiled by: NIST Mass Spectrometry Data Center, William E. Wallace, director

Column type CapillaryCapillary
Active phase HP-5MSDB-5
Column length (m) 30.30.
Carrier gas HeHe
Substrate
Column diameter (mm) 0.250.25
Phase thickness (μm) 0.250.25
Program 60C (1 min) => 5 C/min => 210C => 10 C/min => 280C (15 min)50C (1min) => 5C/min => 100C => 10C/min => 250C (9min)
I 1715.21716.
ReferenceAndriamaharavo, 2014Beaulieu and Grimm, 2001
Comment MSDC-RI MSDC-RI

Phase change data

Data compiled by: Thermodynamics Research Center, NIST Boulder Laboratories, Chris Muzny director

Quantity Value Units Method Reference Comment
Tboil559.15KN/AProstenik, Stanacev, et al., 1962Uncertainty assigned by TRC = 4. K
Quantity Value Units Method Reference Comment
Tfus298.KN/ALanda, 1925Uncertainty assigned by TRC = 4. K
Tfus297.7KN/ALe Sueur, 1905Uncertainty assigned by TRC = 3. K

In addition to the Thermodynamics Research Center (TRC) data available from this site, much more physical and chemical property data is available from the following TRC products:

Kovats' RI, non-polar column, temperature ramp

View large format table.

Column type Active phase I Reference Comment
CapillaryBP-11713.Raina, Verma, et al., 200625. m/0.32 mm/0.25 μm, N2, 5. K/min, 220. C @ 13. min; Tstart: 60. C
CapillaryCP Sil 8 CB1714.Tayoub, Schwob, et al., 200630. m/0.25 mm/0.25 μm, H2, 50. C @ 2. min, 3. K/min; Tend: 220. C
CapillaryCP Sil 8 CB1714.Tayoub, Schwob, et al., 2006, 230. m/0.25 mm/0.25 μm, H2, 50. C @ 2. min, 3. K/min; Tend: 220. C

Kovats' RI, non-polar column, custom temperature program

View large format table.

Column type Active phase I Reference Comment
CapillaryBP-11715.Dwivedi, Khan, et al., 200425. m/0.25 mm/0.25 μm, N2; Program: 60C => 5C/min => 220C(5min) => 3C/min => 245C(5min)
CapillaryHP-51715.Palic, Stojanovic, et al., 200230. m/0.25 mm/0.25 μm, He; Program: 50 C 20 C/min -> 70 C 9 C/min -> 280 C
CapillaryDB-5MS1713.Maia, Andrade, et al., 200030. m/0.25 mm/0.25 μm, He; Program: 40C => 2C/min => 60C => 4C/min => 260C
CapillaryHP-51715.Stojanovic, Palic, et al., 200030. m/0.25 mm/0.25 μm, He; Program: 50 0C 20 K/min -> 70 0C 9 K/min -> 280 0C

Van Den Dool and Kratz RI, non-polar column, temperature ramp

View large format table.

Column type Active phase I Reference Comment
Capillary5 % Phenyl methyl siloxane1731.Zaikin, 201030. m/0.25 mm/0.25 μm, 15. K/min, 270. C @ 15. min; Tstart: 60. C
CapillaryRTX-11693.Paolini, Muselli, et al., 200760. m/0.22 mm/0.25 μm, He, 2. K/min, 230. C @ 35. min; Tstart: 60. C
CapillaryHP-51717.Flamini, Tebano, et al., 200630. m/0.25 mm/0.25 μm, N2, 60. C @ 10. min, 5. K/min; Tend: 220. C
CapillaryHP-51710.Javidnia, Miri, et al., 200630. m/0.25 mm/0.25 μm, He, 3. K/min; Tstart: 60. C; Tend: 260. C
CapillaryHP-5MS1707.Kukic J., Petrovic S., et al., 200630. m/0.25 mm/0.25 μm, He, 3. K/min; Tstart: 60. C; Tend: 280. C
CapillaryHP-5MS1711.Saroglou, Dorizas, et al., 200630. m/0.25 mm/0.25 μm, He, 60. C @ 5. min, 4. K/min; Tend: 280. C
CapillaryHP-51717.Xian Q., Chen H., et al., 200630. m/0.25 mm/0.25 μm, He, 3. K/min, 220. C @ 20. min; Tstart: 50. C
CapillaryCP Sil 5 CB1702.Ziegenbein, Hanssen, et al., 200625. m/0.25 mm/0.4 μm, He, 10. K/min; Tstart: 80. C; Tend: 270. C
CapillaryDB-51713.bin Jantan, Yalvema, et al., 200525. m/0.25 mm/0.25 μm, N2, 75. C @ 10. min, 3. K/min, 210. C @ 1. min
CapillaryHP-51715.Magalhães, Ruiz, et al., 20054. K/min; Column length: 30. m; Tstart: 50. C; Tend: 290. C
CapillaryHP-5MS1711.Pino, Mesa, et al., 200530. m/0.25 mm/0.25 μm, He, 60. C @ 2. min, 4. K/min, 250. C @ 20. min
CapillarySPB-11690.Chisholm, Jell, et al., 200330. m/0.25 mm/0.25 μm, He, 35. C @ 5. min, 4. K/min, 225. C @ 20. min
CapillarySPB-11695.Chisholm, Wilson, et al., 200325. m/0.25 mm/0.25 μm, 35. C @ 10. min, 4. K/min; Tend: 225. C
CapillaryHP-51717.Dural, Bagci, et al., 200330. m/0.25 mm/0.25 μm, N2, 60. C @ 10. min, 5. K/min; Tend: 220. C
CapillaryDB-51717.Flamini, Cioni, et al., 200330. m/0.25 mm/0.25 μm, He, 3. K/min; Tstart: 60. C; Tend: 240. C
CapillaryHP-51715.Fokialakis, Melliou, et al., 200330. m/0.25 mm/0.25 μm, He, 3. K/min; Tstart: 60. C; Tend: 280. C
CapillaryHP-51715.Fokialakis, Magiatis, et al., 200230. m/0.25 mm/0.25 μm, 60. C @ 5. min, 3. K/min; Tend: 280. C
CapillaryHP-5MS1714.Skaltsa, Mavrommati, et al., 200130. m/0.25 mm/0.25 μm, He, 60. C @ 5. min, 4. K/min; Tend: 280. C
CapillaryCP Sil 8 CB1721.Elmore, Mottram, et al., 200060. m/0.25 mm/0.25 μm, He, 40. C @ 2. min, 4. K/min; Tend: 280. C
CapillaryHP-51715.Lazari, Skaltsa, et al., 200030. m/0.25 mm/0.25 μm, He, 50. C @ 5. min, 4. K/min; Tend: 280. C
CapillaryHP-51714.Lazari, Skaltsa, et al., 2000, 230. m/0.25 mm/0.25 μm, He, 50. C @ 5. min, 4. K/min; Tend: 280. C
CapillaryOV-1011690.Yang, Sugisawa, et al., 1992N2, 2. K/min; Column length: 50. m; Column diameter: 0.25 mm; Tstart: 80. C; Tend: 200. C
CapillaryOV-1011692.Yang, Sugisawa, et al., 1992N2, 2. K/min; Column length: 50. m; Column diameter: 0.25 mm; Tstart: 80. C; Tend: 200. C

Van Den Dool and Kratz RI, polar column, temperature ramp

View large format table.

Column type Active phase I Reference Comment
CapillaryRTX-Wax2016.Paolini, Muselli, et al., 200760. m/0.22 mm/0.25 μm, He, 2. K/min, 230. C @ 35. min; Tstart: 60. C
CapillaryHP-Wax2060.Flamini, Tebano, et al., 200630. m/0.25 mm/0.25 μm, N2, 60. C @ 10. min, 5. K/min; Tend: 220. C
CapillaryZB-Wax2024.Ledauphin, Basset, et al., 200630. m/0.25 mm/0.15 μm, He, 35. C @ 5. min, 5. K/min, 220. C @ 10. min
CapillaryStabilwax2041.Cros, Lignot, et al., 200560. m/0.25 mm/0.25 μm, He, 40. C @ 5. min, 3. K/min, 240. C @ 10. min
CapillaryStabilwax2041.Cros, Vandanjon, et al., 200360. m/0.25 mm/0.25 μm, He, 40. C @ 5. min, 3. K/min, 240. C @ 10. min
CapillaryCP-Wax 52CB2012.Liu, Yang, et al., 2001H2, 2. K/min; Column length: 50. m; Column diameter: 0.32 mm; Tstart: 50. C; Tend: 200. C
CapillaryDB-Wax2042.Shiratsuchi, Shimoda, et al., 199460. m/0.25 mm/0.25 μm, 2. K/min, 230. C @ 60. min; Tstart: 50. C
CapillaryDB-Wax2042.Shiratsuchi, Shimoda, et al., 1994, 260. m/0.25 mm/0.25 μm, He, 2. K/min, 230. C @ 60. min; Tstart: 50. C

Normal alkane RI, non-polar column, temperature ramp

View large format table.

Column type Active phase I Reference Comment
CapillaryHP-51715.Bi Kouame, Bedi, et al., 201030. m/0.25 mm/0.25 μm, Helium, 50. C @ 5. min, 50. K/min, 300. C @ 5. min
CapillaryHP-51713.Kahriman, Tosun, et al., 201030. m/0.32 mm/0.25 μm, Helium, 60. C @ 2. min, 3. K/min; Tend: 240. C
CapillaryHP-5 MS1719.Ogunwande, Flamini, et al., 201030. m/0.25 mm/0.25 μm, Helium, 60. C @ 10. min, 5. K/min; Tend: 220. C
CapillaryHP-5 MS1716.Radulovic, Blagojevic, et al., 201030. m/0.25 mm/0.25 μm, Helium, 5. K/min, 290. C @ 10. min; Tstart: 70. C
CapillaryHP-51717.Radulovic, Dordevic, et al., 201030. m/0.25 mm/0.25 μm, Hydrogen, 5. K/min; Tstart: 70. C; Tend: 290. C
CapillaryDB-5 MS1715.Silva, Pott, et al., 201030. m/0.25 mm/0.25 μm, Helium, 3. K/min; Tstart: 60. C; Tend: 240. C
CapillaryHP-11697.Wetwiayaklung, Thavanapong, et al., 200925. m/0.32 mm/0.17 μm, 50. C @ 5. min, 1. K/min, 260. C @ 5. min
CapillaryHP-5 MS1707.Forero, Quijano, et al., 200830. m/0.25 mm/0.25 μm, Helium, 50. C @ 4. min, 4. K/min, 230. C @ 10. min
CapillaryHP-51717.Asekun, Olusegun, et al., 2007He, 5. K/min; Column length: 30. m; Column diameter: 0.25 mm; Tstart: 70. C; Tend: 240. C
CapillaryHP-5MS1702.Ferhat, Tigrine-Kordjani, et al., 200730. m/0.25 mm/0.25 μm, He, 60. C @ 8. min, 2. K/min, 250. C @ 15. min
CapillaryHP-51711.Pavlovic, Petrovic, et al., 200725. m/0.32 mm/0.52 μm, Helium, 4. K/min; Tstart: 40. C; Tend: 280. C
CapillaryHP-51708.Ristic, Krivokuca-Dokic, et al., 200730. m/0.25 mm/0.25 μm, Helium, 4. K/min; Tstart: 40. C; Tend: 260. C
CapillaryDB-51714.Morteza-Semnani, Akbarzadeh, et al., 200630. m/0.25 mm/0.25 μm, He, 4. K/min; Tstart: 60. C; Tend: 220. C
CapillaryDB-51724.Najafpour Navaei, Mirza, et al., 200630. m/0.25 mm/0.25 μm, He, 4. K/min; Tstart: 50. C; Tend: 250. C
CapillaryDB-51695.Ouamba, Ouabonzi, et al., 200625. m/0.25 mm/0.15 μm, N2, 50. C @ 3. min, 4. K/min; Tend: 200. C
CapillaryPE-51705.Pandey-Rai S., Mallavarapu G.R., et al., 200650. m/0.32 mm/0.25 μm, He, 100. C @ 1. min, 3. K/min; Tend: 280. C
CapillaryHP-51707.Pino, Sauri-Duch, et al., 200630. m/0.25 mm/0.25 μm, H2, 50. C @ 2. min, 4. K/min, 280. C @ 10. min
CapillaryHP-11693.Bendimerad and Bendiab, 200550. m/0.2 mm/0.5 μm, He, 2. K/min, 250. C @ 60. min; Tstart: 60. C
CapillaryDB-51713.Chaverri and Cicció, 200530. m/0.25 mm/0.25 μm, He, 3. K/min; Tstart: 60. C; Tend: 240. C
CapillaryDB-51716.Morteza-Semnani and Saeedi, 200530. m/0.25 mm/0.25 μm, He, 60. C @ 4. min, 4. K/min; Tend: 220. C
CapillaryHP-51714.Utsunomia, Kawata, et al., 200530. m/0.32 mm/0.25 μm, Helium, 4. K/min, 300. C @ 5. min; Tstart: 40. C
CapillaryCP Sil 5 CB1697.Agnaniet, Menut, et al., 200430. m/0.25 mm/0.25 μm, N2, 5. K/min; Tstart: 50. C; Tend: 200. C
CapillaryDB-51715.Dhanda, Pegg, et al., 200360. m/0.25 mm/0.25 μm, He, 35. C @ 2. min, 5. K/min, 280. C @ 4. min
CapillaryHP-11690.Valette, Fernandez, et al., 200350. m/0.2 mm/0.5 μm, He, 2. K/min, 220. C @ 40. min; Tstart: 60. C
CapillaryDB-51694.Limberger, Simões-Pires, et al., 200230. m/0.25 mm/0.25 μm, He, 3. K/min; Tstart: 60. C; Tend: 250. C
CapillaryDB-51715.Maia, da Silva, et al., 200230. m/0.25 mm/0.25 μm, He, 3. K/min; Tstart: 60. C; Tend: 240. C
CapillaryOptima-11696.Brun, Bessière, et al., 200125. m/0.20 mm/0.25 μm, He, 50. C @ 3. min, 3. K/min; Tend: 250. C
CapillaryOV-1011690.Yang, 2001N2, 2. K/min; Column length: 50. m; Column diameter: 0.25 mm; Tstart: 80. C; Tend: 200. C
CapillaryOptima-11698.de Beck, Bessière, et al., 200025. m/0.20 mm/0.25 μm, He, 50. C @ 3. min, 3. K/min; Tend: 250. C
CapillaryHP-5MS1720.Tkachev, Dobrotvorsky, et al., 200030. m/0.25 mm/0.25 μm, He, 40. C @ 1. min, 10. K/min, 280. C @ 20. min
CapillaryOV-1011694.Tamura, Nakamoto, et al., 1995N2, 2. K/min; Column length: 50. m; Column diameter: 0.25 mm; Tstart: 80. C; Tend: 200. C
CapillaryOV-1011697.Tamura, Nakamoto, et al., 1995N2, 2. K/min; Column length: 50. m; Column diameter: 0.25 mm; Tstart: 80. C; Tend: 200. C
CapillaryCross-Linked Methylsilicone1695.Bravo and Hotchkiss, 1993He, 35. C @ 3. min, 4. K/min; Column length: 25. m; Column diameter: 0.32 mm; Tend: 225. C
CapillaryOV-1011690.Tamura, Yang, et al., 19932. K/min; Column length: 50. m; Column diameter: 0.25 mm; Tstart: 80. C; Tend: 200. C
CapillaryOV-1011692.Tamura, Yang, et al., 19932. K/min; Column length: 50. m; Column diameter: 0.25 mm; Tstart: 80. C; Tend: 200. C
CapillaryDB-51710.Berdague, Denoyer, et al., 199160. m/0.32 mm/1.0 μm, He, 3. K/min; Tstart: 40. C; Tend: 240. C
CapillaryUltra-11692.Okumura, 199125. m/0.32 mm/0.25 μm, He, 3. K/min; Tstart: 80. C; Tend: 260. C
CapillaryOV-1011696.Sugisawa, Nakamura, et al., 1990Nitrogen, 2. K/min; Column length: 50. m; Column diameter: 0.25 mm; Tstart: 70. C; Tend: 200. C
CapillaryOV-1011694.Sugisawa, Nakamura, et al., 1990Nitrogen, 2. K/min; Column length: 50. m; Column diameter: 0.25 mm; Tstart: 80. C; Tend: 200. C
CapillaryOV-1011693.Yang and Sugisawa, 1990N2, 2. K/min; Column length: 50. m; Column diameter: 0.25 mm; Tstart: 80. C; Tend: 200. C
CapillaryOV-1011693.Yang and Sugisawa, 1990N2, 2. K/min; Column length: 50. m; Column diameter: 0.25 mm; Tstart: 80. C; Tend: 200. C
CapillarySE-541720.Bestmann, Classen, et al., 1988N2, 60. C @ 2. min, 6. K/min; Column length: 25. m; Column diameter: 0.25 mm; Tend: 260. C
CapillaryMethyl Silicone1694.Lorenz, Stern, et al., 19834. K/min, 225. C @ 20. min; Column length: 25. m; Column diameter: 0.2 mm; Tstart: 80. C

Normal alkane RI, non-polar column, custom temperature program

View large format table.

Column type Active phase I Reference Comment
CapillaryTR-5 MS1710.Kurashov, Mitrukova, et al., 201415. m/0.25 mm/0.25 μm, Helium; Program: 35 0C (3 min) 2 0C/min -> 60 0C (3 min) 2 0C/min -> 80 0C (3 min) 4 0C/min -> 120 0C (3 min) 5 0C/min -> 150 0C (3 min) 15 0C/min -> 240 0C (10 min)
CapillaryTR-5 MS1721.Kurashov, Krylova, et al., 201315. m/0.25 mm/0.25 μm, Helium; Program: 35 0C (3 min) 2 0C/min -> 60 0C (3 min) 2 0C/min -> 80 0C (3 min) 4 0C/min -> 120 0C (3 min) 5 0C/min -> 150 0C (3 mion) 15 0C/min -> 240 0C (10 min)
CapillarySLB-5 MS1702.Mondello, 201230. m/0.25 mm/0.25 μm, Helium; Program: not specified
CapillarySLB-5 MS1719.Mondello, 201230. m/0.25 mm/0.25 μm, Helium; Program: not specified
CapillaryHP-51713.Kahriman, Tosun, et al., 201030. m/0.32 mm/0.25 μm, Helium; Program: not specified
CapillaryZB-1 MS1701.Al-Reza, Rahman, et al., 200930. m/0.25 mm/0.25 μm, Helium; Program: 50 0C 3 0C/min -> 150 0C (10 min) 10 0C/min -> 250 0C
CapillaryBPX-51728.se Souza, Cardeal, et al., 200930. m/0.25 mm/0.25 μm, Helium; Program: 35 0C (5 min) 3 0C/min -> 210 0C 40 0C/min -> 240 0C (10 min)
CapillaryBPX-51728.se Souza, Cardeal, et al., 200930. m/0.25 mm/0.25 μm, Helium; Program: not specified
CapillaryHP-11695.Wetwiayaklung, Thavanapong, et al., 200925. m/0.32 mm/0.17 μm; Program: not specified
CapillaryHP-5 MS1714.Xie, Sun, et al., 200830. m/0.25 mm/0.25 μm, Helium; Program: 40 0C (2 min) 4 0C/min -> 220 0C 20 0C/min -> 280 0C
CapillaryHP-5MS1714.Moronkola, Ogunwande, et al., 200730. m/0.25 mm/0.25 μm, He; Program: 40C(10min) => 3C/min => 200C => 2C/min => 220C
CapillaryDB-51715.Nivinsliene, Butkiene, et al., 200750. m/0.32 mm/0.25 μm, Helium; Program: 60 0C (1 min) 5 0C/min -> 160 0C 10 0C/min -> 250 0C
CapillaryHP-51710.Ristic, Krivokuca-Dokic, et al., 200730. m/0.25 mm/0.25 μm, Helium; Program: not specified
CapillaryHP-5 MS1717.Xian, Chen, et al., 200630. m/0.25 mm/0.25 μm, Helium; Program: 40 0C (3 min) 6 0C/min -> 150 0C (1 min) 10 0C/min -> 250 0C (10 min)
CapillaryBP-51728.Eyres, Dufour, et al., 200525. m/0.32 mm/0.50 μm, Helium; Program: 60 0C 6 0C/min -> 210 0C 10 0C/min -> 290 0C (10 min)
CapillaryBP-51705.Eyres, Dufour, et al., 200525. m/0.32 mm/0.50 μm, Helium; Program: not specified
CapillaryBP-51728.Eyres, Dufour, et al., 200525. m/0.32 mm/0.50 μm, Helium; Program: 60 0C 6 0C/min -> 210 0C 10 0C/min -> 290 0C (10 min)
CapillaryBP-51729.Eyres, Dufour, et al., 200525. m/0.32 mm/0.50 μm, Helium; Program: 60 0C 6 0C/min -> 210 0C 10 0C/min -> 290 0C (10 min)
CapillaryBP-51733.Eyres, Dufour, et al., 200525. m/0.32 mm/0.50 μm, Helium; Program: 60 0C 6 0C/min -> 210 0C 10 0C/min -> 290 0C (10 min)
CapillaryBP-51734.Eyres, Dufour, et al., 200525. m/0.32 mm/0.50 μm, Helium; Program: 60 0C 6 0C/min -> 210 0C 10 0C/min -> 290 0C (10 min)
CapillaryHP-11698.Carpino, Mallia, et al., 200412. m/0.32 mm/0.52 μm; Program: 35C(3min) => 6C/min => 190C => 30C/min => 225C
CapillaryDB-51711.Staples, 2004He; Program: not specified
CapillaryHP-5MS1712.Ansorena, Gimeno, et al., 200130. m/0.25 mm/0.25 μm, He; Program: 40C (10min) => 3C/min => 120C => 10C/min => 250C (5min)
CapillaryBPX-51728.Sides, Robards, et al., 200130. m/0.25 mm/0.25 μm, He; Program: 50C(2min) => 10C/min => 110C => 5.7C/min => 200C => 40C/min => 250C(5min)
CapillaryOV-1011690.Yang, 2001N2; Column length: 50. m; Column diameter: 0.25 mm; Program: not specified
CapillaryHP-51713.Ansorena, Astiasarán, et al., 200030. m/0.25 mm/0.25 μm, He; Program: 40C (10min) => 3C/min => 120C => 10C/min => 250C (5min)
CapillaryBPX-51725.Madruga, Arruda, et al., 200050. m/0.32 mm/0.50 μm, Helium; Program: 40 0C (5 min) 20 0C/min -> 60 0C (5 min) 4 0C/min -> 250 0C (10 min)
CapillarySF-961696.Kawasaki, Matsui, et al., 1998Column length: 40. m; Column diameter: 0.28 mm; Program: 75C => 3C/min => 190C(25min) => 3C/min => 210C
CapillaryCP Sil 5 CB1687.Weyerstahl, Marschall, et al., 1998He; Column length: 25. m; Phase thickness: 0.39 μm; Program: not specified

Normal alkane RI, polar column, temperature ramp

View large format table.

Column type Active phase I Reference Comment
CapillaryStabilwax2041.Cros, Vandanjon, et al., 200760. m/0.25 mm/0.25 μm, Helium, 40. C @ 5. min, 3. K/min, 240. C @ 10. min
CapillaryInnowax2020.Bendimerad and Bendiab, 200550. m/0.2 mm/0.5 μm, He, 2. K/min, 250. C @ 60. min; Tstart: 60. C
CapillaryCP-Wax 52CB2004.Rohloff and Bones, 200530. m/0.32 mm/0.25 μm, He, 40. C @ 1. min, 4. K/min; Tend: 220. C
CapillaryStabilwax2041.Cros, Vandanjon, et al., 2003, 260. m/0.25 mm/0.25 μm, Helium, 40. C @ 5. min, 3. K/min, 240. C @ 10. min

References

Bardakci, Demirci, et al., 2012
Bardakci, H.; Demirci, B.; Yesilada, E.; Kirmizibekmez, H.; Naser, K.H.C., Chemical composition of the essential oil of the subterranean parts of Valeriana alliariifolia, Rec. Nat. Prod., 2012, 6, 1, 89-92. [all data]

Welke, Manfroi, et al., 2012
Welke, J.E.; Manfroi, V.; Zanus, M.; Lazarotto, M.; Zini, C.A., Characterization of the volatile profile of Brazilian merlot wines through comprehensive two dimensional gas chromatography time-of-flight mass spectrometric detection, J. Chromatogr. A, 2012, 1226, 124-139, https://doi.org/10.1016/j.chroma.2012.01.002 . [all data]

Wedge, Klun, et al., 2009
Wedge, D.E.; Klun, J.A.; Tabanca, N.; Demirci, B.; Ozek, T.; Baser, K.H.C.; Liu, Z.; Zhang, S.; Cantrell, C.L.; Zhang, J., Bioactivity-guided fractionation and GC/MS fingerprinting of Amgelica sinensis and Angelica archangelica root components for antifungal and mosquito deterrent activity, J. Agric. Food Chem., 2009, 57, 2, 464-470, https://doi.org/10.1021/jf802820d . [all data]

Baser K.H.C. and Demirci B., 2007
Baser K.H.C.; Demirci B., Studies on Betula essential oils, Arkivoc, 2007, 7, 335-348. [all data]

Duman, Kartal, et al., 2005
Duman, H.; Kartal, M.; Altun, L.; Demirci, B.; Baser, K.H.C., The essential oil of Stachys laetivirens Kotschy Boiss. ex Rech. fil., endemic in Turkey, Flavour Fragr. J., 2005, 20, 1, 48-50, https://doi.org/10.1002/ffj.1362 . [all data]

Altintas, Kose, et al., 2004
Altintas, A.; Kose, Y.B.; Yucel, E.; Demirci, B.; Baser, K.H.C., Composition of the essential oil of Centaurea dichroa, Chem. Nat. Compd. (Engl. Transl.), 2004, 40, 6, 604-605, https://doi.org/10.1007/s10600-005-0051-9 . [all data]

Demirci and Baser, 2003
Demirci, B.; Baser, K.H.C., Essential oils from the buds of Betula spp. growing in Turkey, Flavour Fragr. J., 2003, 18, 2, 87-90, https://doi.org/10.1002/ffj.1159 . [all data]

Erdemoglu, Sener, et al., 2003
Erdemoglu, N.; Sener, B.; Demirci, B.; Baser, K.H.C., The glycosidically bound volatile compounds of Taxus baccata, Chem. Nat. Compd. (Engl. Transl.), 2003, 39, 2, 195-198, https://doi.org/10.1023/A:1024870031960 . [all data]

Kürkcüoglu, Demirci, et al., 2003
Kürkcüoglu, M.; Demirci, B.; Tabanca, N.; Özek, T.; Baser, K.H.C., The essential oil of Achillea falcata L., Flavour Fragr. J., 2003, 18, 3, 192-194, https://doi.org/10.1002/ffj.1176 . [all data]

Tunalier, Kirimer, et al., 2002
Tunalier, Z.; Kirimer, N.; Baser, K.H.C., The composition of essential oils from various parts of Juniperus foetidissima, Chem. Nat. Compd. (Engl. Transl.), 2002, 38, 1, 43-47, https://doi.org/10.1023/A:1015725630556 . [all data]

Gören, Demirci, et al., 2001
Gören, N.; Demirci, B.; Baser, K.H.C., Composition of the essential oils of Tanacetum spp. from Turkey, Flavour Fragr. J., 2001, 16, 3, 191-194, https://doi.org/10.1002/ffj.976 . [all data]

Tabanca, Kirimer, et al., 2001
Tabanca, N.; Kirimer, N.; Can Baser, K.H., The composition of essential oils from two varieties of Sideritis erythrantha var. erythrantha and var. cedretorum, Turk. J. Chem., 2001, 25, 201-208. [all data]

Kirimer, Tabanca, et al., 2000
Kirimer, N.; Tabanca, N.; Özek, T.; Tümen, G.; Baser, K.H.C., Essential oils of annual Sideritis species growing in Turkey, Pharm. Biol., 2000, 38, 2, 106-111, https://doi.org/10.1076/1388-0209(200004)3821-1FT106 . [all data]

Weyerstahl, Marschall, et al., 1998
Weyerstahl, P.; Marschall, H.; Weirauch, M.; Thefeld, K.; Surburg, H., Constituents of commercial Labdanum oil, Flavour Fragr. J., 1998, 13, 5, 295-318, https://doi.org/10.1002/(SICI)1099-1026(1998090)13:5<295::AID-FFJ751>3.0.CO;2-I . [all data]

Kerrola and Kallio, 1994
Kerrola, K.M.; Kallio, H.P., Extraction of volatile compounds of angelica (Angelica archangelica L.) root by liquid carbon dioxide, J. Agric. Food Chem., 1994, 42, 10, 2235-2245, https://doi.org/10.1021/jf00046a030 . [all data]