Isoquinolinium,1,3-dihydro-1,3-dioxo-2H-inden-2-ylide

Gas phase ion energetics data

Data compiled by: Sharon G. Lias, Rhoda D. Levin, and Sherif A. Kafafi

Ionization energy determinations

IE (eV) Method Reference
7.5CTSKampars and Neilands, 1975

References

Kampars and Neilands, 1975
Kampars, V.; Neilands, O., Characteristics of π- electron structure of betainelike active methylene group derivatives. VI. Character of long-wave absorption bands and charge transfer complexes of 1,3-indanodine onium betaines, Latv. PSR Zinat. Akad. Vestis, Kim. Ser., 1975, 6, 727. [all data]