2H-Pyran-2-one, 6-pentyl-

Van Den Dool and Kratz RI, non-polar column, temperature ramp

View large format table.

Column type Active phase I Reference Comment
CapillaryHP-11406.Cavalli, Fernandez, et al., 200350. m/0.2 mm/0.33 μm, He, 60. C @ 5. min, 2. K/min, 250. C @ 20. min

Van Den Dool and Kratz RI, non-polar column, custom temperature program

View large format table.

Column type Active phase I Reference Comment
CapillarySE-541450.Derail, Hofmann, et al., 199930. m/0.32 mm/0.25 μm, He; Program: 35C (2min) => 40C/min => 50C => 4C/min => 230C (10min)

Van Den Dool and Kratz RI, polar column, temperature ramp

View large format table.

Column type Active phase I Reference Comment
CapillaryDB-Wax2175.Aubert, Günata, et al., 200330. m/0.32 mm/0.5 μm, 40. C @ 3. min, 2. K/min, 245. C @ 20. min
CapillaryDB-Wax2175.Aubert, Günata, et al., 200330. m/0.32 mm/0.5 μm, 40. C @ 3. min, 2. K/min, 245. C @ 20. min

Van Den Dool and Kratz RI, polar column, custom temperature program

View large format table.

Column type Active phase I Reference Comment
CapillaryFFAP2176.Derail, Hofmann, et al., 199930. m/0.32 mm/0.25 μm, He; Program: 35C (2min) => 40C/min => 60C => 4C/min => 230C (10min)
CapillaryFFAP2176.Derail, Hofmann, et al., 199930. m/0.32 mm/0.25 μm, He; Program: 35C (2min) => 40C/min => 60C => 4C/min => 230C (10min)

Normal alkane RI, non-polar column, temperature ramp

View large format table.

Column type Active phase I Reference Comment
CapillaryHP-51465.N/A30. m/0.32 mm/0.25 μm, Helium, 40. C @ 2. min, 5. K/min, 250. C @ 5. min
CapillaryDB-11415.Engel, Flath, et al., 198860. m/0.315 mm/0.25 μm, He, 4. K/min; Tstart: 50. C; Tend: 250. C

Normal alkane RI, non-polar column, custom temperature program

View large format table.

Column type Active phase I Reference Comment
Capillary 1453.Brandi, Bar, et al., 2011Program: not specified
CapillarySE-301434.Vinogradov, 2004Program: not specified

Normal alkane RI, polar column, temperature ramp

View large format table.

Column type Active phase I Reference Comment
CapillaryZB-Wax2143.N/A30. m/0.32 mm/0.25 μm, Helium, 40. C @ 2. min, 5. K/min, 250. C @ 5. min
CapillaryZB-Wax2143.Wu, Krings, et al., 200530. m/0.32 mm/0.25 μm, He, 40. C @ 2. min, 5. K/min, 250. C @ 10. min
CapillaryDB-Wax2176.Engel, Flath, et al., 198860. m/0.322 mm/0.25 μm, He, 4. K/min; Tstart: 50. C; Tend: 230. C
CapillaryDB-Wax2163.Takeoka, Flath, et al., 198860. m/0.25 mm/0.25 μm, H2, 30. C @ 2. min, 2. K/min; Tend: 180. C
CapillaryDB-Wax2164.Takeoka, Flath, et al., 198860. m/0.25 mm/0.25 μm, H2, 30. C @ 2. min, 2. K/min; Tend: 180. C

Normal alkane RI, polar column, custom temperature program

View large format table.

Column type Active phase I Reference Comment
CapillaryCarbowax 20M2166.Vinogradov, 2004Program: not specified

References

Cavalli, Fernandez, et al., 2003
Cavalli, J.-F.; Fernandez, X.; Lizzani-Cuvelier, L.; Loiseau, A.-M., Comparison of static headspace, headspace solid phase microextraction, headspace sorptive extraction, and direct thermal desorption techniques on chemical composition of French olive oils, J. Agric. Food Chem., 2003, 51, 26, 7709-7716, https://doi.org/10.1021/jf034834n . [all data]

Derail, Hofmann, et al., 1999
Derail, C.; Hofmann, T.; Schieberle, P., Differences in key odorants of handmade juice of yellow-flesh peaches (Prunus persica L.) induced by the workup procedure, J. Agric. Food Chem., 1999, 47, 11, 4742-4745, https://doi.org/10.1021/jf990459g . [all data]

Aubert, Günata, et al., 2003
Aubert, C.; Günata; Ambid, C.; Baumes, R., Changes in physicochemical characteristics and volatile constituents of yellow- and white-fleshed nectarines during maturation and artificial ripening, J. Agric. Food Chem., 2003, 51, 10, 3083-3091, https://doi.org/10.1021/jf026153i . [all data]

Engel, Flath, et al., 1988
Engel, K.-H.; Flath, R.A.; Buttery, R.G.; Mon, T.R.; Ramming, D.W.; Teranishi, R., Investigation of volatile constituents in nectarines. 1. Analytical and sensory characterization of aroma components in some nectarine cultivars, J. Agric. Food Chem., 1988, 36, 3, 549-553, https://doi.org/10.1021/jf00081a036 . [all data]

Brandi, Bar, et al., 2011
Brandi, F.; Bar, E.; Mourgues, F.; Horvath, G.; Turcsi, E.; Giuliano, G.; Liverani, A.; Tartarini, S.; Lewinsohn, E.; Rosati, C., Study of Redhaven peach and its white-fleshed mutant suggests a key role of CCD4 carotenoid dioxygenase in carotenoid and norisoprenoid volatile metabolism, BMC Plant Biol., 2011, 11, 24, 1-14. [all data]

Vinogradov, 2004
Vinogradov, B.A., Production, composition, properties and application of essential oils, 2004, retrieved from http://viness.narod.ru. [all data]

Wu, Krings, et al., 2005
Wu, S.; Krings, U.; Zorn, H.; Berger, R.G., Volatile compounds from the fruiting bodies of beefsteak fungus Fistulina hepatica (Schaeffer: Fr.) Fr., Food Chem., 2005, 92, 2, 221-226, https://doi.org/10.1016/j.foodchem.2004.07.013 . [all data]

Takeoka, Flath, et al., 1988
Takeoka, G.R.; Flath, R.A.; Güntert, M.; Jennings, W., Nectarine volatiles: vacuum steam distillation versus headspace sampling, J. Agric. Food Chem., 1988, 36, 3, 553-560, https://doi.org/10.1021/jf00081a037 . [all data]