Phosphenothious chloride

Gas phase ion energetics data

Data compiled by: Sharon G. Lias, John E. Bartmess, Joel F. Liebman, John L. Holmes, Rhoda D. Levin, and W. Gary Mallard

Ionization energy determinations

IE (eV) Method Reference Comment
10.3PEBinnewies, Solouki, et al., 1984Vertical value
10.3PEBinnewies, Solouki, et al., 1984Vertical value

References

Binnewies, Solouki, et al., 1984
Binnewies, M.; Solouki, B.; Bock, H.; Becherer, R.; Ahlrichs, R., O=P-Cl und S=P-Cl: Ionisation in der Gasphase, Angew. Chem., 1984, 96, 704. [all data]