1-Cyclopropyl-2-methylbenzene

Condensed phase thermochemistry data

Data compiled by: Hussein Y. Afeefy, Joel F. Liebman, and Stephen E. Stein

Quantity Value Units Method Reference Comment
Δfliquid75.3 ± 0.8kJ/molCcbKozina, Kropivnitskaya, et al., 1969
Quantity Value Units Method Reference Comment
Δcliquid-5725.4 ± 0.8kJ/molCcbKozina, Kropivnitskaya, et al., 1969Corresponding Δfliquid = 75.3 kJ/mol (simple calculation by NIST; no Washburn corrections)

References

Kozina, Kropivnitskaya, et al., 1969
Kozina, M.P.; Kropivnitskaya, A.G.; Gembitskii, P.A.; Loim, N.M., Heats of combustion of some vinyl- and cyclopropylbenzenes, Moscow Univ. Chem. Bull. (Engl. Transl.), 1969, 24, 60-62. [all data]