homofuraneol

Normal alkane RI, polar column, temperature ramp

Data compiled by: NIST Mass Spectrometry Data Center, William E. Wallace, director

Column type CapillaryCapillaryCapillaryCapillaryCapillary
Active phase HP-FFAPHP-FFAPDB-FFAPDB-WaxDB-Wax
Column length (m) 25.25.30.30.30.
Carrier gas HeliumHelium H2He
Substrate
Column diameter (mm) 0.320.320.320.320.25
Phase thickness (μm) 0.500.500.250.50.25
Tstart (C) 45.45.0.40.40.
Tend (C) 220.220.200.200.185.
Heat rate (K/min) 15.15.6.4.4.
Initial hold (min)   2.5.4.
Final hold (min)     20.
I 2107.2111.2095.2105.2101.
ReferenceWanakhachornkrai and Lertsiri, 9999Wanakhachornkrai and Lertsiri, 9999Laselan, Buettner, et al., 2009Culleré, Escudero, et al., 2004Lee and Noble, 2003
Comment MSDC-RI MSDC-RI MSDC-RI MSDC-RI MSDC-RI
Column type CapillaryCapillaryCapillaryCapillaryCapillary
Active phase HP-FFAPHP-FFAPDB-WaxDB-WaxDB-Wax
Column length (m) 25.25.30.30.30.
Carrier gas HeHeH2HeH2
Substrate
Column diameter (mm) 0.320.320.320.320.32
Phase thickness (μm) 0.50.50.50.50.5
Tstart (C) 45.45.40.40.40.
Tend (C) 220.220.200.240.200.
Heat rate (K/min) 15.15.4.7.4.
Initial hold (min)   5. 5.
Final hold (min)    5.60.
I 2111.2107.2106.2070.2105.
ReferenceWanakhachornkrai and Lertsiri, 2003Wanakhachornkrai and Lertsiri, 2003Ferreira, Ortín, et al., 2002Lin, Rouseff, et al., 2002Aznar, López, et al., 2001
Comment MSDC-RI MSDC-RI MSDC-RI MSDC-RI MSDC-RI
Column type CapillaryCapillary
Active phase DB-WaxDB-Wax
Column length (m) 30.30.
Carrier gas H2H2
Substrate
Column diameter (mm) 0.320.32
Phase thickness (μm) 0.50.5
Tstart (C) 40.60.
Tend (C) 200.245.
Heat rate (K/min) 4.3.
Initial hold (min) 5.3.
Final hold (min) 60.20.
I 2105.2072.
ReferenceFerreira, Aznar, et al., 2001Kotseridis and Baumes, 2000
Comment MSDC-RI MSDC-RI

Van Den Dool and Kratz RI, polar column, temperature ramp

Data compiled by: NIST Mass Spectrometry Data Center, William E. Wallace, director

Column type CapillaryCapillaryCapillaryCapillaryCapillary
Active phase DB-WaxInnowaxDB-WaxFFAPDB-Wax
Column length (m) 30.30.30.30.30.
Carrier gas HeH2He He
Substrate
Column diameter (mm) 0.250.250.320.320.32
Phase thickness (μm) 0.250.250.50.250.5
Tstart (C) 50.45.40.40.40.
Tend (C) 180.210.240.240.265.
Heat rate (K/min) 3.53.57.6.7.
Initial hold (min) 2.5. 2.
Final hold (min) 25.20.5.10.5.
I 2078.2105.2104.2088.2109.
ReferenceBotelho, Caldeira, et al., 2007Botelho, Caldeira, et al., 2007Ruiz Perez-Cacho, Mahattanatawee, et al., 2007Steinhaus and Schieberle, 2007Gurbuz O., Rouseff J.M., et al., 2006
Comment MSDC-RI MSDC-RI MSDC-RI MSDC-RI MSDC-RI
Column type CapillaryCapillaryCapillaryCapillary
Active phase DB-FFAPDB-WaxDB-WaxDB-Wax
Column length (m) 30.30.30.30.
Carrier gas N2Helium He
Substrate
Column diameter (mm) 0.250.320.320.32
Phase thickness (μm) 0.250.500.50.50
Tstart (C) 40.40.40.40.
Tend (C) 230.240.240.240.
Heat rate (K/min) 5.7.7.7.
Initial hold (min) 2.
Final hold (min) 6.5.5.5.
I 2079.2045.2070.2073.
ReferenceColahan-Sederstrom and Peterson, 2005Bell, 2004Valim, Rouseff, et al., 2003Lin and Rouseff, 2001
Comment MSDC-RI MSDC-RI MSDC-RI MSDC-RI

Van Den Dool and Kratz RI, non-polar column, custom temperature program

Data compiled by: NIST Mass Spectrometry Data Center, William E. Wallace, director

Column type CapillaryCapillaryCapillaryCapillaryCapillary
Active phase DB-5DB-5SE-54SE-54DB-5MS
Column length (m) 30.30.30.30.30.
Carrier gas HeHeHeHe
Substrate
Column diameter (mm) 0.250.250.320.320.25
Phase thickness (μm) 0.250.250.250.250.5
Program 40C(2min) => 5C/min => 100C => 4C/min => 230C(10min)35 C (2 min) 40 C/min -> 50 C (2 min) 4 C/min -> 230 C40C (2min) => 40C/min => 50C (5min) => 6C/min => 230C (15min)40C (2min) => 40C/min => 50C (5min) => 6C/min => 230C (15min)40C(2min) => 6C/min => 180C => 10C/min => 250C
I 1136.1139.1178.1178.1128.
ReferenceKlesk and Qian, 2003Zehentbauer and Reineccius, 2002Hofmann and Schieberle, 1997Hofmann and Schieberle, 1997Milo and Reineccius, 1997
Comment MSDC-RI MSDC-RI MSDC-RI MSDC-RI MSDC-RI

Van Den Dool and Kratz RI, non-polar column, temperature ramp

View large format table.

Column type Active phase I Reference Comment
CapillaryDB-51135.Steinhaus and Schieberle, 200730. m/0.32 mm/0.25 μm, 40. C @ 2. min, 6. K/min, 240. C @ 10. min
CapillaryDB-51146.Colahan-Sederstrom and Peterson, 200530. m/0.25 mm/0.25 μm, N2, 40. C @ 2. min, 5. K/min, 230. C @ 6. min
CapillaryDB-5MS1142.Whetstine, Cadwallader, et al., 200530. m/0.25 mm/0.25 μm, 40. C @ 3. min, 10. K/min, 200. C @ 20. min
CapillaryZB-51145.Bell, 200430. m/0.32 mm/0.50 μm, Helium, 7. K/min, 265. C @ 5. min; Tstart: 40. C
CapillaryDB-51139.Valim, Rouseff, et al., 200360. m/0.25 mm/0.25 μm, He, 7. K/min; Tstart: 40. C; Tend: 275. C

Van Den Dool and Kratz RI, polar column, custom temperature program

View large format table.

Column type Active phase I Reference Comment
CapillaryFFAP2059.Fritsch and Schieberle, 200530. m/0.32 mm/0.25 μm, He; Program: 35C(2min) => 40C/min => 60C(2min) => 6C/min => 180C => 20C/min => 230C(10min)
CapillaryStabilwax2100.Wang, Finn, et al., 200530. m/0.32 mm/1. μm, He; Program: 40C(2min) => 5C/min => 100C => 4C/min => 230C (10min)
CapillaryStabilwax2086.Wang, Finn, et al., 200530. m/0.32 mm/1. μm, He; Program: 40C(2min) => 5C/min => 100C => 4C/min => 230C (10min)
CapillaryStabilwax2067.Klesk, Qian, et al., 200430. m/0.32 mm/1. μm, He; Program: 40C (2min) => 5C/min => 100C => 4C/min => 230C (10min)
CapillaryDB-Wax2105.Selli, Cabaroglu, et al., 200430. m/0.32 mm/0.5 μm, H2; Program: 60C(3min) => 2C/min => 220C => 3C/min => 245C (20min)
CapillaryStabilwax2078.Klesk and Qian, 200330. m/0.32 mm/1. μm, He; Program: 40C(2min) => 5C/min => 100C => 4C/min => 230C(10min)
CapillaryDB-FFAP2097.Zehentbauer and Reineccius, 200230. m/0.25 mm/0.25 μm, He; Program: 35 0C (2 min) 40 K/min -> 60 0C (2 min) 6 K/min -> 230 0C
CapillaryDB-FFAP2061.Rychlik and Bosset, 200130. m/0.32 mm/0.25 μm, He; Program: 35C(2min) => 40C/min => 60C (2min) => 5C/min => 240C
CapillaryFFAP2050.Hofmann and Schieberle, 199730. m/0.32 mm/0.25 μm, He; Program: 40C (2min) => 40C/min => 60C (5min) => 6C/min => 230C (15min)
CapillaryFFAP2050.Hofmann and Schieberle, 199730. m/0.32 mm/0.25 μm, He; Program: 40C (2min) => 40C/min => 60C (5min) => 6C/min => 230C (15min)
CapillaryFFAP2085.Kubícková and Grosch, 199730. m/0.32 mm/0.25 μm; Program: 35C (2min) => 40C/min => 60C (2min) => 6C/min => 230C (10min)

Normal alkane RI, non-polar column, temperature ramp

View large format table.

Column type Active phase I Reference Comment
CapillaryDB-51140.Kotseridis and Baumes, 200030. m/0.32 mm/0.5 μm, H2, 60. C @ 3. min, 3. K/min, 245. C @ 20. min

Normal alkane RI, non-polar column, custom temperature program

View large format table.

Column type Active phase I Reference Comment
CapillarySE-541159.Lasekan, Buettner, et al., 200730. m/0.32 mm/0.25 μm; Program: 35C(2min) => 40C/min => 60C(2min) => 6C/min => 180C => 10C/min => 230C(10min)
CapillaryMFE-731175.Escudero, Gogorza, et al., 2004Program: not specified
CapillaryHP-5MS1175.Martí, Mestres, et al., 200330. m/0.25 mm/0.25 μm, He; Program: 40C(5min) => 2C/min => 120C => 10C/min => 210C (30min)
CapillaryMFE-731175.Ferreira, Ortín, et al., 2002H2; Program: not specified
CapillaryMFE-731175.Aznar, López, et al., 200130. m/0.32 mm/0.1 μm, H2; Program: 40C(5min) => 2C/min => 120C => 10C/min => 210C(30min)
CapillaryMFE-731175.Ferreira, Aznar, et al., 200130. m/0.32 mm/0.1 μm, H2; Program: 40 C (5min) => 2C/min => 120C => 10 C/min => 210 C (30min)

Normal alkane RI, polar column, custom temperature program

View large format table.

Column type Active phase I Reference Comment
CapillaryDB-FFAP2095.Lasekan, Buettner, et al., 200730. m/0.32 mm/0.25 μm; Program: 35C(2min) => 40C/min => 50C(2min) => 6C/min => 180C => 10C/min => 230C(10min)
CapillaryDB-Wax2108.Escudero, Gogorza, et al., 2004Program: not specified
CapillaryCP-WAX 57CB2112.Martí, Mestres, et al., 200350. m/0.25 mm/0.2 μm, He; Program: 40C(10min) => 5C/min => 100C => 3C/min => 180C => 20C/min => 210C (10min)
CapillaryDB-FFAP2090.Mayer and Grosch, 200130. m/0.32 mm/0.25 μm, He; Program: 35 0C (2 min) 40 K/min -> 60 0C (1 min) 6 K/min -> 240 0C
CapillaryFFAP2100.Blank and Schieberle, 199330. m/0.32 mm/0.25 μm, Helium; Program: 35 0C (2 min) 40 0C/min -> 50 0C (2 min) 6 0C/min -> 180 0C 10 0C/min -> 230 0C (10 min)

References

Wanakhachornkrai and Lertsiri, 9999
Wanakhachornkrai, P.; Lertsiri, S., Comparison of determination method for volatile compounds in Thai soy sauce, Analytical, Nutritional and Clinical Methods, 9999, 1-11. [all data]

Laselan, Buettner, et al., 2009
Laselan, P.; Buettner, A.; Christlbauer, M., Investigation of the retronasal perseption of palm wine (Elaeis guineensis) aroma by application of sensory analysis and exhaled odorant measurement (EXOM), African J. of Food, Agriculture, Nutrition and development, 2009, 9, 2, 793-813. [all data]

Culleré, Escudero, et al., 2004
Culleré, L.; Escudero, A.; Cacho, J.; Ferreira, V., Gas chromatography-olfactometry and chemical quantitative study of the aroma of six premium auality Spanish aged red wines, J. Agric. Food Chem., 2004, 52, 6, 1653-1660, https://doi.org/10.1021/jf0350820 . [all data]

Lee and Noble, 2003
Lee, S.-J.; Noble, A.C., Characterization of odor-active compounds in Californian Chardonnay wines using GC-olfactometry and GC-mass spectrometry, J. Agric. Food Chem., 2003, 51, 27, 8036-8044, https://doi.org/10.1021/jf034747v . [all data]

Wanakhachornkrai and Lertsiri, 2003
Wanakhachornkrai, P.; Lertsiri, S., Analytical, nutritional, and clinical methods. Comparison of determination method for volatile compounds in Thai soy sauce, Food Chem., 2003, 83, 4, 619-629, https://doi.org/10.1016/S0308-8146(03)00256-5 . [all data]

Ferreira, Ortín, et al., 2002
Ferreira, V.; Ortín, N.; Escudero, A.; López, R.; Cacho, J., Chemical characterization of the aroma of grenache Rosé wines: aroma extract dilution analysis, quantitative determination, and sensory reconstitution studies, J. Agric. Food Chem., 2002, 50, 14, 4048-4054, https://doi.org/10.1021/jf0115645 . [all data]

Lin, Rouseff, et al., 2002
Lin, J.; Rouseff, R.L.; Barros, S.; Naim, M., Aroma composition changes in early season grapefruit juice produced from thermal concentration, J. Agric. Food Chem., 2002, 50, 4, 813-819, https://doi.org/10.1021/jf011154g . [all data]

Aznar, López, et al., 2001
Aznar, M.; López, R.; Cacho, J.F.; Ferreira, V., Identification and quantification of impact odorants of aged red wines from Rioja. GC-olfactometry, quantitative GC-MS, and odor evaluation of HPLC fractions, J. Agric. Food Chem., 2001, 49, 6, 2924-2929, https://doi.org/10.1021/jf001372u . [all data]

Ferreira, Aznar, et al., 2001
Ferreira, V.; Aznar, M.; López, R.; Cacho, J., Quantitative gas chromatography-olfactometry carried out at different dilutions of an extract. Differences in the odor profiles of four high-quality spanish aged red wines, J. Agric. Food Chem., 2001, 49, 10, 4818-4824, https://doi.org/10.1021/jf010283u . [all data]

Kotseridis and Baumes, 2000
Kotseridis, Y.; Baumes, R., Identification of impact odorants in Bordeaux red grape juice, in the commercial yeast used for its fermentation, and in the produced wine, J. Agric. Food Chem., 2000, 48, 2, 400-406, https://doi.org/10.1021/jf990565i . [all data]