9-Tricosene, (Z)-

Normal alkane RI, polar column, temperature ramp

Data compiled by: NIST Mass Spectrometry Data Center, William E. Wallace, director

Column type Capillary
Active phase Stabilwax
Column length (m) 60.
Carrier gas H2
Substrate
Column diameter (mm) 0.25
Phase thickness (μm) 0.25
Tstart (C) 30.
Tend (C) 238.
Heat rate (K/min) 4.
Initial hold (min) 2.
Final hold (min) 25.
I 2320.
ReferenceDrijfhout and Groot, 2001
Comment MSDC-RI

Phase change data

Data compiled by: Robert L. Brown and Stephen E. Stein

Quantity Value Units Method Reference Comment
Tboil573.2KN/AAldrich Chemical Company Inc., 1990

References

Drijfhout and Groot, 2001
Drijfhout, F.P.; Groot, A.T., Close-range attraction in Lygocoris pabulinus (L.), J. Chem. Ecol., 2001, 27, 6, 1133-1149, https://doi.org/10.1023/A:1010311928256 . [all data]