1-Methylcyclopropanemethanol

Phase change data

Data compiled as indicated in comments:
TRC - Thermodynamics Research Center, NIST Boulder Laboratories, Chris Muzny director
BS - Robert L. Brown and Stephen E. Stein

Quantity Value Units Method Reference Comment
Tboil394.KN/ADerfer, Greenlee, et al., 1949Uncertainty assigned by TRC = 2. K; not compatible with value reported in 1950 sieber 0; TRC
Quantity Value Units Method Reference Comment
Tfus258.KN/ADerfer, Greenlee, et al., 1949Uncertainty assigned by TRC = 2. K; TRC

Reduced pressure boiling point

Tboil (K) Pressure (bar) Reference Comment
401.21.00Aldrich Chemical Company Inc., 1990BS

In addition to the Thermodynamics Research Center (TRC) data available from this site, much more physical and chemical property data is available from the following TRC products:

References

Derfer, Greenlee, et al., 1949
Derfer, J.M.; Greenlee, K.W.; Boord, C.E., A New Synthesis of Monoalkylcyclobutanes: Reduction of Neopentyl Type Tribromides, J. Am. Chem. Soc., 1949, 71, 175. [all data]

Aldrich Chemical Company Inc., 1990
Aldrich Chemical Company Inc., Catalog Handbook of Fine Chemicals, Aldrich Chemical Company, Inc., Milwaukee WI, 1990, 1. [all data]