1,2,3-Benzoselenadiazole

Gas phase ion energetics data

Data compiled by: Sharon G. Lias, Rhoda D. Levin, and Sherif A. Kafafi

Ionization energy determinations

IE (eV) Method Reference Comment
8.5PESchulz and Schweig, 1980
8.83PESchulz and Schweig, 1980Vertical value

References

Schulz and Schweig, 1980
Schulz, R.; Schweig, A., 6-Fulveneselone, Angew. Chem. Int. Ed. Engl., 1980, 19, 69. [all data]