Benzene, methyl-, trifluoro deriv.

Condensed phase thermochemistry data

Data compiled by: Hussein Y. Afeefy, Joel F. Liebman, and Stephen E. Stein

Quantity Value Units Method Reference Comment
Δfliquid-636.7 ± 1.0kJ/molCcrGood, Lacina, et al., 1964Reanalyzed by Cox and Pilcher, 1970, Original value = -620.45 kJ/mol; see Good, Scott, et al., 1956
Quantity Value Units Method Reference Comment
Δcliquid-3369.3 ± 0.50kJ/molCcrGood, Lacina, et al., 1964see Good, Scott, et al., 1956

References

Good, Lacina, et al., 1964
Good, W.D.; Lacina, J.L.; DePrater, B.L.; McCullough, J.P., A new approach to the combustion calorimetry of silicon and organosilicon compounds. Heats of formation of quartz, fluorosilicic acid, and hexamethyldisiloxane, J. Phys. Chem., 1964, 68, 579-586. [all data]

Cox and Pilcher, 1970
Cox, J.D.; Pilcher, G., Thermochemistry of Organic and Organometallic Compounds, Academic Press, New York, 1970, 1-636. [all data]

Good, Scott, et al., 1956
Good, W.D.; Scott, D.W.; Waddington, G., Combustion calorimetry of organic fluorine compounds by a rotating-bomb method, J. Phys. Chem., 1956, 60, 1080-1089. [all data]