Tetracyclo[3.3.2.02,4.06,8.]dec-9-ene (1α,2α,3β,5β,6α,7α)-

Gas phase ion energetics data

Data compiled by: Sharon G. Lias, John E. Bartmess, Joel F. Liebman, John L. Holmes, Rhoda D. Levin, and W. Gary Mallard

Ionization energy determinations

IE (eV) Method Reference Comment
8.4PEGleiter, Bohm, et al., 1983
8.64PEGleiter, Bohm, et al., 1983Vertical value

References

Gleiter, Bohm, et al., 1983
Gleiter, R.; Bohm, M.C.; de Meijere, A.; Preuss, T., Electronic structure and reactivity of homobarrelene derivatives, J. Org. Chem., 1983, 48, 796. [all data]