Benzofurazan

Gas phase thermochemistry data

Data compiled by: Hussein Y. Afeefy, Joel F. Liebman, and Stephen E. Stein

Quantity Value Units Method Reference Comment
Δfgas300.2 ± 2.1kJ/molCcbLeitao, Pilcher, et al., 1990Different experiments
Δfgas300.7 ± 2.1kJ/molCcbCarpenter, Zimmer, et al., 1971Different experiments
Δfgas272.7kJ/molCcbBrent, 1963Different experiments

Condensed phase thermochemistry data

Data compiled by: Hussein Y. Afeefy, Joel F. Liebman, and Stephen E. Stein

Quantity Value Units Method Reference Comment
Δfsolid56.36 ± 0.33kcal/molCcbLeitao, Pilcher, et al., 1990Different experiments
Δfsolid56.4 ± 0.2kcal/molCcbCarpenter, Zimmer, et al., 1971Different experiments
Quantity Value Units Method Reference Comment
Δcsolid-757.29 ± 0.26kcal/molCcbLeitao, Pilcher, et al., 1990Different experiments
Δcsolid-757.29 ± 0.1kcal/molCcbCarpenter, Zimmer, et al., 1971Different experiments
Δcsolid-753.11 ± 0.22kcal/molCcbBrent, 1963Different experiments

References

Leitao, Pilcher, et al., 1990
Leitao, M.L.; Pilcher, G.; Acree, W.E., Jr.; Zvaigzne, A.I.; Tucker, S.A.; Ribeiro Da Silva, M.D.M.C., Enthalpies of combustion of phenazine N-oxide, phenazine, benzofuroxan, and benzofurazan: the dissociation entrhalpies of the (N-O) bonds, J. Chem. Thermodyn., 1990, 22, 923-928. [all data]

Carpenter, Zimmer, et al., 1971
Carpenter, G.A.; Zimmer, M.F.; Baroody, E.E.; Robb, R.A., Enthalpy of formation of N,N,N'-trifluorohexaneamidine, (2-fluoro-2,2-dinitroethyl)acrylate,2,4-dinitrophenoxyethanol, and diisobutylazelate, J. Chem. Eng. Data, 1971, 16, 46-49. [all data]

Brent, 1963
Brent, C.R., A thermochemical study of the C=N and N-O bonds exergies in tetramethylene furoxan and cyclohexanedione dioxime, Ph.D. Thesis for Tulane University, 1963, 1-71. [all data]