Acetamide,2,2,2-trifluoro-N-(2-methylphenyl)-

Gas phase ion energetics data

Data compiled by: Sharon G. Lias, Rhoda D. Levin, and Sherif A. Kafafi

Ionization energy determinations

IE (eV) Method Reference Comment
8.84 ± 0.05PESzepes, Distefano, et al., 1974Vertical value

References

Szepes, Distefano, et al., 1974
Szepes, L.; Distefano, G.; Pignataro, S., Steric inhibition of resonance in acetanilides by UV photoelectron spectroscopy, Ann. Chim., 1974, 64, 159. [all data]