2-Piperidinecarboxamide, N-(2,6-dimethylphenyl)-, (2S)-

Phase change data

Data compiled by: William E. Acree, Jr., James S. Chickos

Enthalpy of fusion

ΔfusH (kJ/mol) Temperature (K) Method Reference
24.19403.2DSCNemák, Ács, et al., 1997

References

Nemák, Ács, et al., 1997
Nemák, Katalin; Ács, Mária; Kozma, D.; Fogassy, E., Racemic compound formation-conglomerate formation, Journal of Thermal Analysis, 1997, 48, 3, 691-696, https://doi.org/10.1007/BF01979515 . [all data]