Benzene, 1-bromo-3-ethyl-

Phase change data

Data compiled by: Robert L. Brown and Stephen E. Stein

Quantity Value Units Method Reference Comment
Tboil477.2KN/AWeast and Grasselli, 1989

Reduced pressure boiling point

Tboil (K) Pressure (bar) Reference
358.70.027Weast and Grasselli, 1989

Reaction thermochemistry data

Data compiled by: Hussein Y. Afeefy, Joel F. Liebman, and Stephen E. Stein

Individual Reactions

Ethylbenzene + Benzene, bromo- = C8H9Br + Benzene

By formula: C8H10 + C6H5Br = C8H9Br + C6H6

Quantity Value Units Method Reference Comment
Δr-0.59 ± 0.021kJ/molCmMerdzhanov, Alenin, et al., 1982gas phase; Heat of isomerization at 349 K

Benzene, 1-bromo-4-ethyl- = C8H9Br

By formula: C8H9Br = C8H9Br

Quantity Value Units Method Reference Comment
Δr-0.80 ± 0.012kJ/molEqkMerdzhanov, Alenin, et al., 1982gas phase; Heat of isomerization at 330 K

Benzene, 1-bromo-2-ethyl- = C8H9Br

By formula: C8H9Br = C8H9Br

Quantity Value Units Method Reference Comment
Δr-1.20 ± 0.33kJ/molCmMerdzhanov, Alenin, et al., 1982gas phase; Heat of isomerization at 330 K

References

Weast and Grasselli, 1989
CRC Handbook of Data on Organic Compounds, 2nd Editon, Weast,R.C and Grasselli, J.G., ed(s)., CRC Press, Inc., Boca Raton, FL, 1989, 1. [all data]

Merdzhanov, Alenin, et al., 1982
Merdzhanov, V.R.; Alenin, V.I.; Nesterova, T.N.; Rozhnov, A.M., Study of equilibrium transformation of ethylbromobenzenes, Izv. Vyssh. Uchebn. Zaved., Khim. Khim. Tekhnol., 1982, 25, 1047-1049. [all data]