Tetradecanol

Van Den Dool and Kratz RI, non-polar column, temperature ramp

Data compiled by: NIST Mass Spectrometry Data Center, William E. Wallace, director

Column type CapillaryCapillaryCapillaryCapillaryCapillary
Active phase HP-5MSDB-5BP-1DB-5HP-5
Column length (m) 30.30.50.30.30.
Carrier gas HeHeHeHeHe
Substrate
Column diameter (mm) 0.250.320.220.260.25
Phase thickness (μm) 0.250.250.250.25
Tstart (C) 60.40.60.60.60.
Tend (C) 280.250.230.246.260.
Heat rate (K/min) 4.5.2.3.3.
Initial hold (min) 5.2.
Final hold (min)  5.35.
I 1676.1665.1653.1671.1678.
ReferenceSaroglou, Marin, et al., 2007Wu, Zorn, et al., 2007Vellutini, Baldovini, et al., 2005Adams, Habte, et al., 2004Javidnia, Miri, et al., 2004
Comment MSDC-RI MSDC-RI MSDC-RI MSDC-RI MSDC-RI
Column type CapillaryCapillaryCapillaryCapillaryCapillary
Active phase HP-1DB-5HP-5DB-5CP Sil 5 CB
Column length (m) 50.25.30.30.50.
Carrier gas HeHeHeH2He
Substrate
Column diameter (mm) 0.20.250.250.250.32
Phase thickness (μm) 0.33 0.250.250.4
Tstart (C) 60.60.60.60.60.
Tend (C) 250.260.280.240.280.
Heat rate (K/min) 2.4.4.3.3.
Initial hold (min) 5. 5. 10.
Final hold (min) 20.   60.
I 1654.1676.1676.1677.1664.
ReferenceCavalli, Fernandez, et al., 2003Javidnia, Miri, et al., 2003Skaltsa, Demetzos, et al., 2003Nogueira, Bittrich, et al., 2001Pino and Marbot, 2001
Comment MSDC-RI MSDC-RI MSDC-RI MSDC-RI MSDC-RI
Column type CapillaryCapillaryCapillary
Active phase HP-5MSHP-5DB-5
Column length (m) 30.30.30.
Carrier gas HeHe
Substrate
Column diameter (mm) 0.250.250.25
Phase thickness (μm) 0.250.250.25
Tstart (C) 60.50.100.
Tend (C) 280.280.275.
Heat rate (K/min) 4.4.5.
Initial hold (min) 5.5.1.
Final hold (min)   3.
I 1676.1677.1677.
ReferenceSkaltsa, Mavrommati, et al., 2001Lazari, Skaltsa, et al., 2000Marques, McElfresh, et al., 2000
Comment MSDC-RI MSDC-RI MSDC-RI

Normal alkane RI, polar column, custom temperature program

Data compiled by: NIST Mass Spectrometry Data Center, William E. Wallace, director

Column type CapillaryCapillaryCapillaryCapillaryCapillary
Active phase CP-Wax 52 CBHP Innowax FSPHP-InnowaxHP Innowax FSPHP-Innowax FSC
Column length (m) 60.60.30.60.60.
Carrier gas HeliumHeliumHeliumN2
Substrate
Column diameter (mm) 0.250.250.250.250.25
Phase thickness (μm) 0.250.250.250.250.25
Program 45 0C (5 min) 3 0C/min -> 150 0C 10 0C/min -> 240 0C60 0C (10 min) 4 0C/min -> 220 0C (10 min) 1 0C/min -> 240 0C (20 min)30 0C (5 min) 5 0C/min -> 100 0C (5 min) 1 0C/min -> 130 0C 10 0C/min -> 195 0C (45 min)60C(10min) => 4C/min => 220C(10min) => 1C/min => 240C60C(10min) => 4C/min => 220C (10min) => 1C/min => 240C
I 2167.2179.2176.2179.2179.
ReferenceRomeo, Verzera, et al., 2009Wedge, Klun, et al., 2009Narain, Galvao, et al., 2007Tabanca N., Demirci B., et al., 2007Tabanca, Demirci, et al., 2006
Comment MSDC-RI MSDC-RI MSDC-RI MSDC-RI MSDC-RI
Column type CapillaryCapillaryCapillary
Active phase HP Innowax FSPHP-Innowax FSCHP-Innowax FSC
Column length (m) 60.60.60.
Carrier gas N2He
Substrate
Column diameter (mm) 0.250.250.25
Phase thickness (μm) 0.250.250.25
Program 60C(10min) => 4C/min => 220C(10min) => 1C/min => 240C60C (10min) => 4C/min => 220C (10min) => 1C/min => 240C60C(10min) => 4C/min => 220C(10min) => 1C/min => 240C
I 2179.2179.2179.
ReferenceAltintas, Kose, et al., 2004Demirci, Baser, et al., 2003Kaya, Demirci, et al., 2001
Comment MSDC-RI MSDC-RI MSDC-RI

Normal alkane RI, non-polar column, temperature ramp

Data compiled by: NIST Mass Spectrometry Data Center, William E. Wallace, director

Column type CapillaryCapillaryCapillaryCapillaryCapillary
Active phase Mega 5 MSElite-5MSHP-5SPB-5DB-5
Column length (m) 60.30.30.30.30.
Carrier gas HeliumHeHeHeHe
Substrate
Column diameter (mm) 0.250.320.320.320.25
Phase thickness (μm) 0.250.50.250.250.25
Tstart (C) 40.40.60.40.60.
Tend (C) 240.280.260.220.220.
Heat rate (K/min) 3.4.5.5.4.
Initial hold (min) 2.5.2.1.5.
Final hold (min)  10.13.20.
I 1685.1677.1676.1682.1673.
ReferenceRomeo, Verzera, et al., 2009Tava, Pecetti, et al., 2007Yayli, Yasar, et al., 2005Ledauphin, Guichard, et al., 2003Morteza-Semnani, Saeedi, et al., 2002
Comment MSDC-RI MSDC-RI MSDC-RI MSDC-RI MSDC-RI
Column type CapillaryCapillary
Active phase DB-5OV-101
Column length (m) 30.50.
Carrier gas  He
Substrate
Column diameter (mm) 0.250.22
Phase thickness (μm) 0.251.
Tstart (C) 140.100.
Tend (C) 240.220.
Heat rate (K/min) 5.1.
Initial hold (min)  1.
Final hold (min)
I 1675.41664.
ReferenceSvatos, Kalinová, et al., 2001Camciuc, Bessière, et al., 1998
Comment MSDC-RI MSDC-RI

Normal alkane RI, polar column, temperature ramp

Data compiled by: NIST Mass Spectrometry Data Center, William E. Wallace, director

Column type CapillaryCapillary
Active phase DB-WaxCarbowax 20M
Column length (m) 60.50.
Carrier gas HeHe
Substrate
Column diameter (mm) 0.250.25
Phase thickness (μm) 0.25
Tstart (C) 40.60.
Tend (C) 200.180.
Heat rate (K/min) 2.2.
Initial hold (min)  4.
Final hold (min)
I 2164.2134.
ReferenceWei, Mura, et al., 2001Kawakami and Kobayashi, 1991
Comment MSDC-RI MSDC-RI

References

Saroglou, Marin, et al., 2007
Saroglou, V.; Marin, P.D.; Rancic, A.; Veljic, M.; Skaltsa, H., Composition and antimicrobial activity of the essential oil of six Hypericum species from Serbia, Biochem. Syst. Ecol., 2007, 35, 3, 146-152, https://doi.org/10.1016/j.bse.2006.09.009 . [all data]

Wu, Zorn, et al., 2007
Wu, S.; Zorn, H.; Krings, U.; Berger, R.G., Volatiles from submerged and surface-cultured beefsteak fungus, Fistulina hepatica, Flavour Fragr. J., 2007, 22, 1, 53-60, https://doi.org/10.1002/ffj.1758 . [all data]

Vellutini, Baldovini, et al., 2005
Vellutini, M.; Baldovini, N.; de Rocca Serra, D. Tomi; Casanova, J., β-Cyclolavandulyl and β-isocyclolavandulyl esters from Peucedanum paniculatum L., an endemic species to Corsica, Phytochemistry, 2005, 66, 16, 1956-1962, https://doi.org/10.1016/j.phytochem.2005.07.001 . [all data]

Adams, Habte, et al., 2004
Adams, R.P.; Habte, M.; Park, S.; Dafforn, M.R., Preliminary comparison of vetiver root essential oils from cleansed (bacteria- and fungus-free) versus non-cleansed (normal) vetiver plants, Biochem. Syst. Ecol., 2004, 32, 12, 1137-1144, https://doi.org/10.1016/j.bse.2004.03.013 . [all data]

Javidnia, Miri, et al., 2004
Javidnia, K.; Miri, R.; Kamalinejad, M.; Sarkarzadeh, H.; Jamalian, A., Chemical composition of the essential oils of Anthemis altissima L. grown in Iran, Flavour Fragr. J., 2004, 19, 3, 213-216, https://doi.org/10.1002/ffj.1277 . [all data]

Cavalli, Fernandez, et al., 2003
Cavalli, J.-F.; Fernandez, X.; Lizzani-Cuvelier, L.; Loiseau, A.-M., Comparison of static headspace, headspace solid phase microextraction, headspace sorptive extraction, and direct thermal desorption techniques on chemical composition of French olive oils, J. Agric. Food Chem., 2003, 51, 26, 7709-7716, https://doi.org/10.1021/jf034834n . [all data]

Javidnia, Miri, et al., 2003
Javidnia, K.; Miri, R.; Azarpira, A.; Tabaei, S.M.H., Composition of the essential oil of Stachys setifera C.A. Mey ssp. iranica growing in Iran, Flavour Fragr. J., 2003, 18, 4, 299-300, https://doi.org/10.1002/ffj.1165 . [all data]

Skaltsa, Demetzos, et al., 2003
Skaltsa, H.D.; Demetzos, C.; Lazari, D.; Sokovic, M., Essential oil analysis and antimicrobial activity of eight Stachys species from Greece, Phytochemistry, 2003, 64, 3, 743-752, https://doi.org/10.1016/S0031-9422(03)00386-8 . [all data]

Nogueira, Bittrich, et al., 2001
Nogueira, P.C.L.; Bittrich, V.; Shepherd, G.J.; Lopes, A.V.; Marsaioli, A.J., The ecological and taxonomic importance of flower volatiles of Clusia species (Guttiferae), Phytochemistry, 2001, 56, 5, 443-452, https://doi.org/10.1016/S0031-9422(00)00213-2 . [all data]

Pino and Marbot, 2001
Pino, J.A.; Marbot, R., Volatile flavor constituents of acerola (Malpighia emarginata DC.) fruit, J. Agric. Food Chem., 2001, 49, 12, 5880-5882, https://doi.org/10.1021/jf010270g . [all data]

Skaltsa, Mavrommati, et al., 2001
Skaltsa, H.D.; Mavrommati, A.; Constantinidis, T., A chemotaxonomic investigation of volatile constituents in Stachys subsect. Swainsonianeae (Labiatae), Phytochemistry, 2001, 57, 2, 235-244, https://doi.org/10.1016/S0031-9422(01)00003-6 . [all data]

Lazari, Skaltsa, et al., 2000
Lazari, D.M.; Skaltsa, H.D.; Constantinidis, T., Volatile constituents of Cerastium candidissimum, a Greek endemic species, Flavour Fragr. J., 2000, 15, 3, 174-176, https://doi.org/10.1002/1099-1026(200005/06)15:3<174::AID-FFJ886>3.0.CO;2-Y . [all data]

Marques, McElfresh, et al., 2000
Marques, F.A.; McElfresh, J.S.; Millar, J.G., Kováts retention indexes of monounsaturated C12, C14, and C16 alcohols, acetates and aldehydes commonly found in lepidopteran pheromone blends, J. Braz. Chem. Soc., 2000, 11, 6, 592-599, https://doi.org/10.1590/S0103-50532000000600007 . [all data]