2,1-Benzisoxazole

Phase change data

Data compiled as indicated in comments:
BS - Robert L. Brown and Stephen E. Stein
AC - William E. Acree, Jr., James S. Chickos

Quantity Value Units Method Reference Comment
Δvap55.3 ± 0.3kJ/molCMatos, Miranda, et al., 2004AC

Reduced pressure boiling point

Tboil (K) Pressure (bar) Reference Comment
374.70.020Aldrich Chemical Company Inc., 1990BS

References

Matos, Miranda, et al., 2004
Matos, M. Agostinha R.; Miranda, Margarida S.; Morais, Victor M.F.; Liebman, Joel F., Aspects of the Aromaticity of Anthranil, Eur. J. Org. Chem., 2004, 2004, 15, 3340-3345, https://doi.org/10.1002/ejoc.200400158 . [all data]

Aldrich Chemical Company Inc., 1990
Aldrich Chemical Company Inc., Catalog Handbook of Fine Chemicals, Aldrich Chemical Company, Inc., Milwaukee WI, 1990, 1. [all data]