C7H9N5

Reaction thermochemistry data

Data compiled by: John E. Bartmess

Individual Reactions

C7H8N5- + Hydrogen cation = C7H9N5

By formula: C7H8N5- + H+ = C7H9N5

Quantity Value Units Method Reference Comment
Δr351.1 ± 4.1kcal/molG+TSSharma and Lee, 2002gas phase; between mMe-phenol and pCF3-aniline
Quantity Value Units Method Reference Comment
Δr344.0 ± 4.0kcal/molIMRBSharma and Lee, 2002gas phase; between mMe-phenol and pCF3-aniline

Gas phase ion energetics data

Data compiled by: John E. Bartmess

De-protonation reactions

C7H8N5- + Hydrogen cation = C7H9N5

By formula: C7H8N5- + H+ = C7H9N5

Quantity Value Units Method Reference Comment
Δr351.1 ± 4.1kcal/molG+TSSharma and Lee, 2002gas phase; between mMe-phenol and pCF3-aniline
Quantity Value Units Method Reference Comment
Δr344.0 ± 4.0kcal/molIMRBSharma and Lee, 2002gas phase; between mMe-phenol and pCF3-aniline

References

Sharma and Lee, 2002
Sharma, S.; Lee, J.K., Acidity of adenine and adenine derivatives and biological implications. A computational and experimental gas-phase study, J. Org. Chem., 2002, 67, 24, 8360-8365, https://doi.org/10.1021/jo0204303 . [all data]