1,1-Bis(difluoroamino)heptane

Condensed phase thermochemistry data

Data compiled by: Hussein Y. Afeefy, Joel F. Liebman, and Stephen E. Stein

Quantity Value Units Method Reference Comment
Δfliquid-64.8 ± 0.28kcal/molCcrGood and Smith, 1970
Quantity Value Units Method Reference Comment
Δcliquid-1240.38 ± 0.28kcal/molCcrGood and Smith, 1970

References

Good and Smith, 1970
Good, W.D.; Smith, N.K., Enthalpies of combustion and formation of 1,1-bis (difluoroamino)heptane N-F Thermochemical bond energy, J. Chem. Eng. Data, 1970, 15, 147-150. [all data]