CAS Reg. No. 27121-81-9

Reaction thermochemistry data

Data compiled by: John E. Bartmess

Individual Reactions

(CAS Reg. No. 27121-81-9 • 4294967295Cl2Si) + Cl2Si = CAS Reg. No. 27121-81-9

By formula: (CAS Reg. No. 27121-81-9 • 4294967295Cl2Si) + Cl2Si = CAS Reg. No. 27121-81-9

Quantity Value Units Method Reference Comment
Δr53.7 ± 3.3kcal/molCIDTPoutsma, Schroeder, et al., 2004gas phase

References

Poutsma, Schroeder, et al., 2004
Poutsma, J.C.; Schroeder, O.E.; Squires, R.R., Experimental chloride ion affinities and theoretical predictions for the absolute heats of formation of SiCl2 and SiClF, Chem. Phys. Lett., 2004, 389, 4-6, 433-437, https://doi.org/10.1016/j.cplett.2004.03.137 . [all data]