C13H2F8

Reaction thermochemistry data

Data compiled by: John E. Bartmess

Individual Reactions

C13HF8- + Hydrogen cation = C13H2F8

By formula: C13HF8- + H+ = C13H2F8

Quantity Value Units Method Reference Comment
Δr1360. ± 8.8kJ/molG+TSTaft and Bordwell, 1988gas phase
Quantity Value Units Method Reference Comment
Δr1328. ± 8.4kJ/molIMRETaft and Bordwell, 1988gas phase

References

Taft and Bordwell, 1988
Taft, R.W.; Bordwell, F.G., Structural and Solvent Effects Evaluated from Acidities Measured in Dimethyl Sulfoxide and in the Gas Phase, Acc. Chem. Res., 1988, 21, 12, 463, https://doi.org/10.1021/ar00156a005 . [all data]