1,3-Cyclopentadiene, 5-ethenylidene-

Gas phase ion energetics data

Data compiled as indicated in comments:
LLK - Sharon G. Lias, Rhoda D. Levin, and Sherif A. Kafafi
RDSH - Henry M. Rosenstock, Keith Draxl, Bruce W. Steiner, and John T. Herron

Ionization energy determinations

IE (eV) Method Reference Comment
8.88EIMamer, Lossing, et al., 1970RDSH
8.29PEMuller, Schweig, et al., 1979Vertical value; LLK

References

Mamer, Lossing, et al., 1970
Mamer, A.; Lossing, F.P.; Hedaya, E.; Kent, M.E., Pyrolysis of bicyclo[2.2.1]hepta-2,5-diene-2,3-dicarboxylic anhydride, Can. J. Chem., 1970, 48, 3606. [all data]

Muller, Schweig, et al., 1979
Muller, C.; Schweig, A.; Thiel, W.; Grahn, W.; Bergman, R.G.; Vollhardt, K.P.C., Photoelectron spectra of 2,5-dehydrotropylidene, 3,6- dehydrooxepin, and fulvenallene, J. Am. Chem. Soc., 1979, 101, 5579. [all data]