Propanedinitrile, (phenylmethylene)-

Normal alkane RI, non-polar column, temperature ramp

Data compiled by: NIST Mass Spectrometry Data Center, William E. Wallace, director

Column type Capillary
Active phase BP-1
Column length (m) 30.
Carrier gas Nitrogen
Substrate
Column diameter (mm) 0.30
Phase thickness (μm) 0.25
Tstart (C) 40.
Tend (C) 280.
Heat rate (K/min) 10.
Initial hold (min) 1.
Final hold (min) 10.
I 1473.
ReferenceGutch and Srivastava, 2012
Comment MSDC-RI

Normal alkane RI, non-polar column, isothermal

Data compiled by: NIST Mass Spectrometry Data Center, William E. Wallace, director

Column type Capillary
Active phase BP-1
Column length (m) 30.
Carrier gas Nitrogen
Substrate
Column diameter (mm) 0.30
Phase thickness (μm) 0.25
Temperature (C) 200.
I 1487.
ReferenceGutch and Srivastava, 2012
Comment MSDC-RI

References

Gutch and Srivastava, 2012
Gutch, P.K.; Srivastava, R.K., Gas chromatographic retention indices of 2-chlorobenzylidenemalononitrile and its analogues, Defence Sci. J., 2012, 62, 5, 319-323, https://doi.org/10.14429/dsj.62.1167 . [all data]