Benzenamine, 4-propyl-

Phase change data

Data compiled by: Robert L. Brown and Stephen E. Stein

Quantity Value Units Method Reference Comment
Tboil498.2KN/AWeast and Grasselli, 1989

Reduced pressure boiling point

Tboil (K) Pressure (atm) Reference
333. - 335.0.0007Frinton Laboratories Inc., 1986

Gas phase ion energetics data

Data compiled by: Sharon G. Lias and Joel F. Liebman

Ionization energy determinations

IE (eV) Method Reference
7.410PESong, Pauls, et al., 1991
7.419PESong, Pauls, et al., 1991

References

Weast and Grasselli, 1989
CRC Handbook of Data on Organic Compounds, 2nd Editon, Weast,R.C and Grasselli, J.G., ed(s)., CRC Press, Inc., Boca Raton, FL, 1989, 1. [all data]

Frinton Laboratories Inc., 1986
Frinton Laboratories Inc., Catalog Number 11, Frinton Laboratories Inc., Vineland, NJ, 1986, 99. [all data]

Song, Pauls, et al., 1991
Song, X.; Pauls, S.; Lucia, J.; Du, P.; Davidson, E.R.; Reilly, J.P., Dependence of p-n-propylaniline ionization potential on molecular conformation: comparison of experiment with theory, J. Am. Chem. Soc., 1991, 113, 3202. [all data]