Trichothec-9-ene-3,4,8,15-tetrol, 12,13-epoxy-, 15-acetate 8-(3-methylbutanoate), (3α,4β,8α)-

Kovats' RI, non-polar column, temperature ramp

View large format table.

Column type Active phase I Reference Comment
CapillarySE-302809.Bata, Ványi, et al., 1983H2, 4. K/min; Column length: 12. m; Column diameter: 0.25 mm; Tstart: 180. C; Tend: 260. C

Normal alkane RI, non-polar column, temperature ramp

View large format table.

Column type Active phase I Reference Comment
CapillarySE-522809.Bata, Ványi, et al., 1984H2, 4. K/min; Column length: 18. m; Column diameter: 0.125 mm; Tstart: 150. C; Tend: 270. C

References

Bata, Ványi, et al., 1983
Bata, Á.; Ványi, A.; Lasztity, R., Simultaneous detection of some fusariotoxins by gas-liquid chromatography, J. Ass. Offic. Anal. Chem, 1983, 66, 3, 577-581. [all data]

Bata, Ványi, et al., 1984
Bata, A.; Ványi, A.; Lásztity, R.; Galácz, J., Determination of trichothecene toxins in foods and feeds, J. Chromatogr., 1984, 286, 357-362, https://doi.org/10.1016/S0021-9673(01)99207-6 . [all data]