Hexacyclopropylethane

Gas phase thermochemistry data

Data compiled by: Hussein Y. Afeefy, Joel F. Liebman, and Stephen E. Stein

Quantity Value Units Method Reference Comment
Δfgas466.5kJ/molCcbBernloehr, Beckhaus, et al., 1984Uc=-11044.0±3.5 cal/g

References

Bernloehr, Beckhaus, et al., 1984
Bernloehr, W.; Beckhaus, H.D.; Peters, K.; Von Schnering, H.G.; Ruechardt, C., Thermolabile hydrocarbons. XXIV. Hexacyclo propylethane - structure, thermochemistry, and stability, Chem. Ber., 1984, 117, 1013-1025. [all data]