Ethylene-d3

Gas phase ion energetics data

Data compiled by: Sharon G. Lias, Rhoda D. Levin, and Sherif A. Kafafi

Ionization energy determinations

IE (eV) Method Reference
10.518 ± 0.007PECarlier and Botter, 1979
10.60 ± 0.03EIGordon, Krige, et al., 1974

References

Carlier and Botter, 1979
Carlier, J.; Botter, R., Photoelectron spectra of ethylene of the six deuterated derivatives, J. Electron Spectrosc. Relat. Phenom., 1979, 17, 91. [all data]

Gordon, Krige, et al., 1974
Gordon, S.M.; Krige, G.J.; Reid, N.W., Isotope effects in the unimolecular decomposition of ethylene by low-energy electron impact, Int. J. Mass Spectrom. Ion Phys., 1974, 14, 109. [all data]