Ethene, 1,1-diethoxy-

Gas phase ion energetics data

Data compiled by: Sharon G. Lias, Rhoda D. Levin, and Sherif A. Kafafi

Ionization energy determinations

IE (eV) Method Reference Comment
8.3PEBock, Wagner, et al., 1974Vertical value

References

Bock, Wagner, et al., 1974
Bock, H.; Wagner, G.; Wittel, K.; Sauer, J.; Seebach, D., Photoelektronenspektren und molekuleigenschaften. XXXII. n/π-konjugation in heterosubstituierten athylenen, Chem. Ber., 1974, 107, 1869. [all data]