3,6,9,12-Tetraoxapentadecane, 1,1,1,2,4,4,5,7,7,8,10,10,11,13,13,14,14,15,15,15-eicosafluoro-5,8,11-tris(trifluoromethyl)-

Phase change data

Data compiled by: Robert L. Brown and Stephen E. Stein

Quantity Value Units Method Reference Comment
Tboil465. - 468.KN/APCR Inc., 1990

References

PCR Inc., 1990
PCR Inc., Research Chemicals Catalog 1990-1991, PCR Inc., Gainesville, FL, 1990, 1. [all data]