1-Pentyl radical

Gas phase ion energetics data

Data compiled as indicated in comments:
LL - Sharon G. Lias and Joel F. Liebman
LLK - Sharon G. Lias, Rhoda D. Levin, and Sherif A. Kafafi

Ionization energy determinations

IE (eV) Method Reference Comment
7.85ESTLias, Bartmess, et al., 1988LL
7.94 ± 0.06EILossing and Maccoll, 1976LLK

References

Lias, Bartmess, et al., 1988
Lias, S.G.; Bartmess, J.E.; Liebman, J.F.; Holmes, J.L.; Levin, R.D.; Mallard, W.G., Gas-phase ion and neutral thermochemistry, J. Phys. Chem. Ref. Data, Suppl. 1, 1988, 17, 1-861. [all data]

Lossing and Maccoll, 1976
Lossing, F.P.; Maccoll, A., Free radicals by mass spectrometry, XLVII. Ionization potentials ionic and heats of formation of C5-C7 alkyl radicals, Can. J. Chem., 1976, 54, 990. [all data]