Poly-L-lysine hydrobromide·phenylalanine copolymer

Condensed phase thermochemistry data

Data compiled by: Eugene S. Domalski and Elizabeth D. Hearing

Constant pressure heat capacity of solid

Cp,solid (J/mol*K) Temperature (K) Reference Comment
366.5300.Roles and Wunderlich, 1993T = 220 to 390 K.
366.5300.Roles, 1991T = 220 to 390 K.

References

Roles and Wunderlich, 1993
Roles, K.A.; Wunderlich, B., Heat capacities of solid copoly (amino acid)s, J. Polym. Sci. Part B, 1993, 31, 279-285. [all data]

Roles, 1991
Roles, K.A., Heat capacity studies of solid poly(amino acids), Diss. Abstr. Int., 1991, B 52(6), 3095. [all data]