Phenol, 4,4'-thiobis-

Phase change data

Data compiled by: William E. Acree, Jr., James S. Chickos

Enthalpy of fusion

ΔfusH (kcal/mol) Temperature (K) Reference
7.419432.9Li, He, et al., 2001

References

Li, He, et al., 2001
Li, Jianchun; He, Yong; Ishida, Kazuki; Yamane, Tsuneo; Inoue, Yoshio, The Hydrogen-Bonding Interactions between 4,4'-Thiodiphenol and Some Poly(hydroxyalkanoic acid)s Revealed by DSC and FT-IR Spectroscopic Analysis, Polym. J., 2001, 33, 10, 773-787, https://doi.org/10.1295/polymj.33.773 . [all data]