Phenol, 4-(1-methylethyl)-, acetate

Kovats' RI, non-polar column, temperature ramp

View large format table.

Column type Active phase I Reference Comment
CapillaryBPX-51454.El-Ghorab, Mansour, et al., 200425. m/0.22 mm/0.25 μm, He, 3. K/min; Tstart: 60. C; Tend: 240. C

References

El-Ghorab, Mansour, et al., 2004
El-Ghorab, A.H.; Mansour, A.F.; El-massry, K.F., Effect of extraction methods on the chemical composition and antioxidant activity of Egyptian marjoram (Majorana hortensis Moench), Flavour Fragr. J., 2004, 19, 1, 54-61, https://doi.org/10.1002/ffj.1276 . [all data]