hexadecane, 1-(p-butylphenyl)-

Phase change data

Data compiled by: Thermodynamics Research Center, NIST Boulder Laboratories, Chris Muzny director

Quantity Value Units Method Reference Comment
Tfus294.KN/AStudt, 1965Uncertainty assigned by TRC = 1. K

In addition to the Thermodynamics Research Center (TRC) data available from this site, much more physical and chemical property data is available from the following TRC products:

References

Studt, 1965
Studt, P., C26-hydrocarbons as model lubricants, Justus Liebigs Ann. Chem., 1965, 685, 49-55. [all data]