6-Chlorododecane

Phase change data

Data compiled by: William E. Acree, Jr., James S. Chickos

Quantity Value Units Method Reference Comment
Δvap65.5kJ/molAStephenson and Malanowski, 1987Based on data from 283. - 328. K. See also Dykyj and Vanko, 1970 and Geiseler, Quitzsch, et al., 1962.

References

Stephenson and Malanowski, 1987
Stephenson, Richard M.; Malanowski, Stanislaw, Handbook of the Thermodynamics of Organic Compounds, 1987, https://doi.org/10.1007/978-94-009-3173-2 . [all data]

Dykyj and Vanko, 1970
Dykyj, J.; Vanko, A., Petrochemica, 1970, 10, 1, 3. [all data]

Geiseler, Quitzsch, et al., 1962
Geiseler, G.; Quitzsch, K.; Hoffmann, J.; Moeschler, W., Z. Phys. Chem. (Leipzig), 1962, 200, 391. [all data]