Methylcyclopentadiene

Gas phase ion energetics data

Data compiled by: Sharon G. Lias, Rhoda D. Levin, and Sherif A. Kafafi

Ionization energy determinations

IE (eV) Method Reference Comment
8.28 ± 0.05PEEvans, Green, et al., 1972Vertical value

References

Evans, Green, et al., 1972
Evans, S.; Green, M.L.H.; Jewitt, B.; Orchard, A.F.; Pygall, C.F., Electronic structure of metal complexes containing π-cyclopentadienyl and related ligands, J. Chem. Soc. Faraday Trans. 2, 1972, 68, 1847. [all data]