trans,trans-2,6-Dimethyl-2,6-octadiene-1,8-diol

Van Den Dool and Kratz RI, polar column, temperature ramp

Data compiled by: NIST Mass Spectrometry Data Center, William E. Wallace, director

Column type CapillaryCapillaryCapillaryCapillaryCapillary
Active phase DB-WaxDB-WaxDB-WaxDB-WaxDB-Wax
Column length (m) 30.30.30.30.30.
Carrier gas  He  He
Substrate
Column diameter (mm) 0.320.320.320.320.259
Phase thickness (μm) 0.50.50.50.50.25
Tstart (C) 40.60.60.60.50.
Tend (C) 245.245.245.245.240.
Heat rate (K/min) 3.3.3.3.4.
Initial hold (min) 3.3.3.3.3.
Final hold (min) 20.20.20.20.
I 2652.2651.2629.2629.2627.
ReferenceAubert, Ambid, et al., 2003Wirth, Guo, et al., 2001Bureau, Razungles, et al., 2000Bureau, Razungles, et al., 2000Suárez, Duque, et al., 1991
Comment MSDC-RI MSDC-RI MSDC-RI MSDC-RI MSDC-RI
Column type Capillary
Active phase DB-Wax
Column length (m) 30.
Carrier gas He
Substrate
Column diameter (mm) 0.259
Phase thickness (μm) 0.25
Tstart (C) 50.
Tend (C) 240.
Heat rate (K/min) 4.
Initial hold (min) 3.
Final hold (min)
I 2640.
ReferenceSuárez, Duque, et al., 1991
Comment MSDC-RI

References

Aubert, Ambid, et al., 2003
Aubert, C.; Ambid, C.; Baumes, R.; Günata, Z., Investigation of bound aroma constituents of yellow-fleshed nectarines (Prunus persica L. Cv. Springbright). Changes in bound aroma profile during maturation, J. Agric. Food Chem., 2003, 51, 21, 6280-6286, https://doi.org/10.1021/jf034613h . [all data]

Wirth, Guo, et al., 2001
Wirth, J.; Guo, W.; Baumes, R.; Günata, Z., Volatile compounds released by enzymatic hydrolysis of glycoconjugates of leaves and grape berries from Vitis vinifera muscat of Alexandria and Shiraz cultivars, J. Agric. Food Chem., 2001, 49, 6, 2917-2923, https://doi.org/10.1021/jf001398l . [all data]

Bureau, Razungles, et al., 2000
Bureau, S.M.; Razungles, A.R.; Baumes, R.L., The aroma of Muscat of Frontignan grapes: effect of the light environment of vine or bunch on volatiles and glycoconjugates, J. Sci. Food Agric., 2000, 80, 14, 2012-2020, https://doi.org/10.1002/1097-0010(200011)80:14<2012::AID-JSFA738>3.0.CO;2-X . [all data]

Suárez, Duque, et al., 1991
Suárez, M.; Duque, C.; Wintoch, H.; Schreier, P., Glycosidically bound aroma compounds from the pulp and the peelings of lulo fruit (Solanum vestissimum D.), J. Agric. Food Chem., 1991, 39, 9, 1643-1645, https://doi.org/10.1021/jf00009a022 . [all data]