Tetracarbonyl disilyl iron

Phase change data

Data compiled by: William E. Acree, Jr., James S. Chickos

Enthalpy of vaporization

ΔvapH (kcal/mol) Temperature (K) Method Reference Comment
10.5353.TAylett, Campbell, et al., 1969Based on data from 329. - 377. K.

References

Aylett, Campbell, et al., 1969
Aylett, B.J.; Campbell, J.M.; Walton, A., Silicon?transition-metal compounds. Part IV. Tetracarbonyldisilyliron and hydridotetracarbonylsilyliron, J. Chem. Soc., A, 1969, 2110, https://doi.org/10.1039/j19690002110 . [all data]