Methyl 4-(prop-1-en-2-yl)cyclohex-1-enecarboxylate

Normal alkane RI, non-polar column, temperature ramp

Data compiled by: NIST Mass Spectrometry Data Center, William E. Wallace, director

Column type CapillaryCapillary
Active phase DB-1DB-5MS
Column length (m) 50.30.
Carrier gas N2He
Substrate
Column diameter (mm) 0.250.25
Phase thickness (μm) 0.250.25
Tstart (C) 90.60.
Tend (C) 240.240.
Heat rate (K/min) 4.3.
Initial hold (min)
Final hold (min)
I 1350.1394.
ReferenceVelasco-Negueruela, Pérez-Alonso, et al., 2006da Silva, Andrade, et al., 2005
Comment MSDC-RI MSDC-RI

References

Velasco-Negueruela, Pérez-Alonso, et al., 2006
Velasco-Negueruela, A.; Pérez-Alonso, M.J.; Pérez de Paz, P.L.; Palá-Paúl, J.; Sanz, J., Analysis by gas chromatography?mass spectrometry of the volatiles from the fruits of Ammodaucus leucotrichus subsp. leucotrichus and subsp. nanocarpus grown in North Africa and the Canary Islands, respectively, J. Chromatogr. A, 2006, 1108, 2, 273-275, https://doi.org/10.1016/j.chroma.2006.01.031 . [all data]

da Silva, Andrade, et al., 2005
da Silva, M.H.L.; Andrade, E.H.A.; Mala, J.G.S., The essential oil of Pectis elongata Kunth occurring in north Brazil, Flavour Fragr. J., 2005, 20, 5, 462-464, https://doi.org/10.1002/ffj.1546 . [all data]