S,S-dichloro-N-[tetrafluoro-1-(trifluoromethyl)ethyl]sulfilimine

Phase change data

Data compiled by: William E. Acree, Jr., James S. Chickos

Enthalpy of vaporization

ΔvapH (kcal/mol) Temperature (K) Method Reference Comment
9.39328.AStephenson and Malanowski, 1987Based on data from 313. - 347. K. See also Von Halasz Und and Glemser, 1970.

References

Stephenson and Malanowski, 1987
Stephenson, Richard M.; Malanowski, Stanislaw, Handbook of the Thermodynamics of Organic Compounds, 1987, https://doi.org/10.1007/978-94-009-3173-2 . [all data]

Von Halasz Und and Glemser, 1970
Von Halasz Und, Sigmar P.; Glemser, Oskar, Darstellung und Eigenschaften vonN-Heptafluorisopropyl- undN= Trifluoracetyl-schwefeldichloridimid und -schwefeloxidimid sowieN.O-Bis-trimethylsilyl-trifluoracetimidsäure, Chem. Ber., 1970, 103, 2, 553-560, https://doi.org/10.1002/cber.19701030225 . [all data]