Cyclopentylbicyclohexyl

Condensed phase thermochemistry data

Data compiled by: Eugene S. Domalski and Elizabeth D. Hearing

Constant pressure heat capacity of liquid

Cp,liquid (J/mol*K) Temperature (K) Reference Comment
433.5313.Gudinowicz, Campbell, et al., 1963T = 313 to 483 K.
430.5311.Gollis, Belenyessy, et al., 1962T = 100, 200, 300°F.

Phase change data

Data compiled by: Thermodynamics Research Center, NIST Boulder Laboratories, Chris Muzny director

Quantity Value Units Method Reference Comment
Tfus280.KN/AGollis, Belenyessy, et al., 1962, 2Uncertainty assigned by TRC = 3.33 K

In addition to the Thermodynamics Research Center (TRC) data available from this site, much more physical and chemical property data is available from the following TRC products:

References

Gudinowicz, Campbell, et al., 1963
Gudinowicz, B.J.; Campbell, R.H.; Adams, J.S., Specific heat measurements of complex saturated hydrocarbons, J. Chem. Eng. Data, 1963, 8, 201-214. [all data]

Gollis, Belenyessy, et al., 1962
Gollis, M.H.; Belenyessy, L.I.; Gudzinowicz, B.J.; Koch, S.D.; Smith, J.O.; Wineman, R.J., Evaluations of pure hydrocarbons as Jet Fuels, J. Chem. Eng. Data, 1962, 7, 311-316. [all data]

Gollis, Belenyessy, et al., 1962, 2
Gollis, M.H.; Belenyessy, L.I.; Gudzinowicz, B.J.; Koch, S.D.; Smith, J.O.; Wineman, R.J., Evaluation of pure hydrocarbons as jet fuels., J. Chem. Eng. Data, 1962, 7, 311-6. [all data]