Cesium anion

Reaction thermochemistry data

Data compiled by: John E. Bartmess

Individual Reactions

Cs- + Hydrogen cation = HCs

By formula: Cs- + H+ = HCs

Quantity Value Units Method Reference Comment
Δr1441.765 ± 0.042kJ/molD-EAScheer, Tho/gersen, et al., 1998gas phase; Given: 0.47164(6) eV
Quantity Value Units Method Reference Comment
Δr1422.7 ± 0.46kJ/molH-TSScheer, Tho/gersen, et al., 1998gas phase; Given: 0.47164(6) eV

References

Scheer, Tho/gersen, et al., 1998
Scheer, M.; Tho/gersen, J.; Bilodeau, R.C.; Brodie, C.A.; Haugen, H.K., Experimental Evidence that the 6s6p2Pj States of Cs- are Shape Resonances, Phys. Rev. Lett., 1998, 80, 4, 684, https://doi.org/10.1103/PhysRevLett.80.684 . [all data]