1,3-Dithiole,2-(4,5-di-trifluoromethyl-1,3-dithiol-2-ylidene

Gas phase ion energetics data

Data compiled by: Sharon G. Lias, Rhoda D. Levin, and Sherif A. Kafafi

Ionization energy determinations

IE (eV) Method Reference Comment
7.95PEGleiter, Kobayashi, et al., 1975Vertical value

References

Gleiter, Kobayashi, et al., 1975
Gleiter, R.; Kobayashi, M.; Spanget-Larsen, J.; Ferraris, J.P.; Bloch, A.N.; Bechgaard, K.; Cowan, D.O., Photoelectron and electronic absorption spectra of tetrathiafulvalene and related compounds, Ber. Bunsen-Ges. Phys. Chem., 1975, 79, 1218. [all data]