Dimethyl(trifluoromethyl)phosphine sulfide

Phase change data

Data compiled by: William E. Acree, Jr., James S. Chickos

Enthalpy of vaporization

ΔvapH (kJ/mol) Temperature (K) Reference Comment
47.2340.Burg and Kang, 1970Based on data from 323. - 357. K.

Enthalpy of sublimation

ΔsubH (kJ/mol) Temperature (K) Reference Comment
68.0310.Burg and Kang, 1970Based on data from 300. - 320. K.

References

Burg and Kang, 1970
Burg, Anton B.; Kang, Dae-Ki., Oxygen and sulfur chemistry of methyltrifluoromethylphosphines, J. Am. Chem. Soc., 1970, 92, 7, 1901-1908, https://doi.org/10.1021/ja00710a020 . [all data]